RHEL5 make menuconfig 出现 error: curses.h: No such file or directory的解决方法

原创 2013年12月02日 11:04:05

在使用命令:make menuconfig的时候出现以下问题

In file included from scripts/kconfig/lxdialog/checklist.c:24:scripts/kconfig/lxdialog/dialog.h:32:20: error: curses.h: No such file or directoryIn file included from scripts/kconfig/lxdialog/checklist.c:24:scripts/kconfig/lxdialog/dialog.h:97: error: expected specifier-qualifier-list before ‘chtype’scripts/kconfig/lxdialog/dialog.h:187: error: expected ‘)’ before ‘*’ tokenscripts/kconfig/lxdialog/dialog.h:194: error: expected ‘)’ before ‘*’ tokenscripts/kconfig/lxdialog/dialog.h:196: error: expected ‘)’ before ‘*’ tokenscripts/kconfig/lxdialog/dialog.h:197: error: expected ‘)’ before ‘*’ tokenscripts/kconfig/lxdialog/dialog.h:198: error: expected ‘)’ before ‘*’ tokenscripts/kconfig/lxdialog/dialog.h:199: error: expected ‘)’ before ‘*’ tokenscripts/kconfig/lxdialog/dialog.h:201: error: expected ‘)’ before ‘*’ tokenscripts/kconfig/lxdialog/checklist.c:31: error: expected ‘)’ before ‘*’ tokenscripts/kconfig/lxdialog/checklist.c:59: error: expected ‘)’ before ‘*’ tokenscripts/kconfig/lxdialog/checklist.c:95: error: expected ‘)’ before ‘*’ tokenscripts/kconfig/lxdialog/checklist.c: In function ‘dialog_checklist’:scripts/kconfig/lxdialog/checklist.c:116: error: ‘WINDOW’ undeclared (first use in this function)scripts/kconfig/lxdialog/checklist.c:116: error: (Each undeclared identifier is reported only oncescripts/kconfig/lxdialog/checklist.c:116: error: for each function it appears in.)scripts/kconfig/lxdialog/checklist.c:116: error: ‘dialog’ undeclared (first use in this function)scripts/kconfig/lxdialog/checklist.c:116: error: ‘list’ undeclared (first use in this function)scripts/kconfig/lxdialog/checklist.c:116: warning: left-hand operand of comma expression has no effectscripts/kconfig/lxdialog/checklist.c:129: warning: implicit declaration of function ‘getmaxy’scripts/kconfig/lxdialog/checklist.c:129: error: ‘stdscr’ undeclared (first use in this function)scripts/kconfig/lxdialog/checklist.c:130: error: ‘KEY_MAX’ undeclared (first use in this function)scripts/kconfig/lxdialog/checklist.c:131: warning: implicit declaration of function ‘getmaxx’scripts/kconfig/lxdialog/checklist.c:137: error: ‘COLS’ undeclared (first use in this function)scripts/kconfig/lxdialog/checklist.c:138: error: ‘LINES’ undeclared (first use in this function)scripts/kconfig/lxdialog/checklist.c:140: warning: implicit declaration of function ‘draw_shadow’scripts/kconfig/lxdialog/checklist.c:142: warning: implicit declaration of function ‘newwin’scripts/kconfig/lxdialog/checklist.c:143: warning: implicit declaration of function ‘keypad’scripts/kconfig/lxdialog/checklist.c:143: error: ‘TRUE’ undeclared (first use in this function)scripts/kconfig/lxdialog/checklist.c:145: warning: implicit declaration of function ‘draw_box’scripts/kconfig/lxdialog/checklist.c:146: error: ‘struct dialog_color’ has no member named ‘atr’scripts/kconfig/lxdialog/checklist.c:146: error: ‘struct dialog_color’ has no member named ‘atr’scripts/kconfig/lxdialog/checklist.c:147: warning: implicit declaration of function ‘wattrset’scripts/kconfig/lxdialog/checklist.c:147: error: ‘struct dialog_color’ has no member named ‘atr’scripts/kconfig/lxdialog/checklist.c:148: warning: implicit declaration of function ‘mvwaddch’scripts/kconfig/lxdialog/checklist.c:150: warning: implicit declaration of function ‘waddch’scripts/kconfig/lxdialog/checklist.c:151: error: ‘struct dialog_color’ has no member named ‘atr’scripts/kconfig/lxdialog/checklist.c:154: warning: implicit declaration of function ‘print_title’scripts/kconfig/lxdialog/checklist.c:156: error: ‘struct dialog_color’ has no member named ‘atr’scripts/kconfig/lxdialog/checklist.c:157: warning: implicit declaration of function ‘print_autowrap’scripts/kconfig/lxdialog/checklist.c:164: warning: implicit declaration of function ‘subwin’scripts/kconfig/lxdialog/checklist.c:171: error: ‘struct dialog_color’ has no member named ‘atr’scripts/kconfig/lxdialog/checklist.c:171: error: ‘struct dialog_color’ has no member named ‘atr’scripts/kconfig/lxdialog/checklist.c:189: warning: implicit declaration of function ‘print_item’scripts/kconfig/lxdialog/checklist.c:192: warning: implicit declaration of function ‘print_arrows’scripts/kconfig/lxdialog/checklist.c:195: warning: implicit declaration of function ‘print_buttons’scripts/kconfig/lxdialog/checklist.c:197: warning: implicit declaration of function ‘wnoutrefresh’scripts/kconfig/lxdialog/checklist.c:199: warning: implicit declaration of function ‘doupdate’scripts/kconfig/lxdialog/checklist.c:202: warning: implicit declaration of function ‘wgetch’scripts/kconfig/lxdialog/checklist.c:210: error: ‘KEY_UP’ undeclared (first use in this function)scripts/kconfig/lxdialog/checklist.c:210: error: ‘KEY_DOWN’ undeclared (first use in this function)scripts/kconfig/lxdialog/checklist.c:220: error: ‘FALSE’ undeclared (first use in this function)scripts/kconfig/lxdialog/checklist.c:221: warning: implicit declaration of function ‘scrollok’scripts/kconfig/lxdialog/checklist.c:222: warning: implicit declaration of function ‘wscrl’scripts/kconfig/lxdialog/checklist.c:232: warning: implicit declaration of function ‘wrefresh’scripts/kconfig/lxdialog/checklist.c:293: warning: implicit declaration of function ‘delwin’scripts/kconfig/lxdialog/checklist.c:297: error: ‘KEY_LEFT’ undeclared (first use in this function)scripts/kconfig/lxdialog/checklist.c:298: error: ‘KEY_RIGHT’ undeclared (first use in this function)scripts/kconfig/lxdialog/checklist.c:310: warning: implicit declaration of function ‘on_key_esc’scripts/kconfig/lxdialog/checklist.c:312: error: ‘KEY_RESIZE’ undeclared (first use in this function)make[1]: *** [scripts/kconfig/lxdialog/checklist.o] Error 1make: *** [menuconfig] Error 2


出现此问题的原因是缺少相关库,需要安装ncurses-devel-5.5-24.20060715.i386.rpm,根据系统的版本不同,库的名字可能不同

RHEL5中的解决方法:

相关的库在镜像中已经存在,我们直接获取安装即可

首先挂载CDROM,创建一个cdrom的目录,使用命令#mount  /dev/cdrom  cdrom/,出现mount: block device /dev/cdrom is write-protected, mounting read-only的打印,正常。

然后,使用命令#find  .  -name   "*curses*"  找到相关的库文件,

./Server/ncurses-5.5-24.20060715.i386.rpm
./Server/ncurses-devel-5.5-24.20060715.i386.rpm
./Server/php-ncurses-5.1.6-15.el5.i386.rpm


最后使用命令安装

[root@localhost cdrom]# rpm -ivh Server/ncurses-devel-5.5-24.20060715.i386.rpm 
warning: Server/ncurses-devel-5.5-24.20060715.i386.rpm: Header V3 DSA signature: NOKEY, key ID 37017186
Preparing...                ########################################### [100%]
   1:ncurses-devel          ########################################### [100%]
[root@localhost cdrom]# 


然后make menuconfig命令就可以正常工作了

版权声明:本文为博主原创文章,未经博主允许不得转载。

相关文章推荐

menuconfig Linux Error: curses.h: No such file or directory Problem Solution

menuconfig Linux Error: curses.h: No such file or directory Problem Solution scripts/kconfig/lx...

scripts/kconfig/lxdialog/dialog.h:26:20: fatal error: curses.h: No such file or directory

Q:scripts/kconfig/lxdialog/dialog.h:26:20: fatal error: curses.h: No such file or directory A:解决办法:...
  • MingLLu
  • MingLLu
  • 2016年09月25日 09:28
  • 2881

解决[Error] g++.exe: 5\mingw\include: No such file or directory

安装C-Free 5 之后出现[Error] g++.exe: 5\mingw\include: No such file or directory; 一、错误的原因:            ...
  • lurao
  • lurao
  • 2015年11月15日 09:31
  • 6758

Linux程序make过程中库文件缺失:cannot find -lixxx && fatal error: xxx.h: No such file or directory 解决方法参考

1. 前言     今天在Ubuntu下安装skyeye准备用于嵌入式开发,在编译的过程中遇到了cannot find -lixxx 和 fatal error: xxx.h: No such fil...

【Ubuntu】cannot find -lixxx && fatal error: xxx.h: No such file or directory 解决方法参考

1. 前言     今天在Ubuntu下安装skyeye准备用于嵌入式开发,在编译的过程中遇到了cannot find -lixxx 和 fatal error: xxx.h: No such fil...

PHP imagick-3.1.0RC2无法安装,提示fatal error: wand/MagickWand.h: No such file or directory 解决方法

PHP安装imagick-3.1.0RC2时提示: an error occur: fatal error: wand/MagickWand.h: No such file or directory...
  • ikscher
  • ikscher
  • 2013年07月09日 13:55
  • 4412

使用py2exe 将python文件转成exe文件(以及 error: [Errno 2] No such file or directory: 'MSVCP90.dll'解决方法)

用python写程序真的很简单,当我们开发出功能后,特别是带窗体的python程序,需要将python程序转成双击运行的exe程序。我们需要一个第三方模块 py2exe,就是将py转成exe的模块。只...

fatal error C1083: 无法打开源文件:“WIN32”: No such file or directory(VS)的解决方法

fatal error C1083: 无法打开源文件:“WIN32”: No such file or directory(VS)的解决方法...

64位linux提示gnu/stubs-32.h:No such file or directory的解决方法

今天在64位linux编译程序时,出现如下错误提示 /usr/include/gnu/stubs.h:7:27: error: gnu/stubs-32.h:No such file or dire...

关于安装MySQLdb出现fatal error: my_config.h: No such file or directory

今天在安装python的模块MySQLdb时,在编译源码时,一直出现一个错误,下面是编译信息: running build running build_py creating build creati...
内容举报
返回顶部
收藏助手
不良信息举报
您举报文章:RHEL5 make menuconfig 出现 error: curses.h: No such file or directory的解决方法
举报原因:
原因补充:

(最多只允许输入30个字)