android studio错误解决finished with non-zero exit value 1 【javax/xml/namespace/QName.class】

原创 2015年07月07日 05:53:11
Error:Execution failed for task ':app:preDexDebug'.

> com.android.ide.common.process.ProcessException: org.gradle.process.internal.ExecException: Process 'command 'C:\Program Files\Java\jdk1.8.0_45\bin\java.exe'' finished with non-zero exit value 1

android studio错误如上

仔细阅读log发现错误源头如下

trouble processing "javax/xml/namespace/QName.class":


网上搜,说某个JAR包的问题,


经确定问题jar包是 某个处理xml的依赖包:

compile files('libs/xpp3-1.1.4c.jar')

这个jar里面也有一个javax/xml/namespace/QName.class;

解决:
360压缩打开jar;
删除qname.class文件;

重新导入jar
解决;

compile files('libs/xpp3-1.1.4c-withnoQname.jar')

javax.xml.namespace.QName类的用法

类 QNamejava.lang.Object javax.xml.namespace.QName所有已实现的接口: Serializable public class QNameextends O...

android 搭建Smack4.2.1 使用openfire 的流程和各种坑

openfire这个im服务器是开源的,但是bug不少,一堆坑。 配合android端使用的是smack,现在目前最新的是4.2.1,以前我已经搭建了4.1.4,但是smack维护还是比较多的,看看...

javax.xml.namespace.QName 解释以及作用JDK

最近在搞webService调用,使用到了QName这个类,经过查找JDK以及一些资料,才明白这个累的作用。          QName  英文全名: qualified name         ...
  • sdmxdzb
  • sdmxdzb
  • 2016年12月07日 16:17
  • 2499

Android编译时出现aapt.exe finished with non-zero exit value 1错误的解决方法

By Long Luo昨天在开发一个项目时,在Android Studio中编译时,gradle编译之后出现了如下错误:Error:Execution failed for task ':sample...

android studio新建项目后出现bug finished with non-zero exit value 1

Error:Execution failed for task ':app:transformClassesWithDexForDebug'. > com.android.ide.common.pro...

Android Studio各种坑爹之:finished with non-zero exit value 1和Return code 1 for dex process.

android { compileSdkVersion 25 buildToolsVersion "25.0.0" //添加如下代码即可解决 dexOptions { ...

Android Studio BUILD FAILED finished with non-zero exit value

Android Studio build failed Android studio gradle 编译失败 错误提示: finished with non-zero exit value 1...
  • aaawqqq
  • aaawqqq
  • 2016年03月03日 17:24
  • 2928

解决Studio引用友盟引起的/jdk1.8.0_45.jdk/Contents/Home/bin/java'' finished with non-zero exit value 2

希望能解决小伙伴么遇到这样的问题!

Android开发 finished with non-zero exit value 1-3,gradle编译异常小结

转载自:http://www.jacpy.com/2016/04/22/android-studio-error-collection.html 在使用Android studio过程中,使...
  • zxt94
  • zxt94
  • 2016年12月16日 15:40
  • 356
内容举报
返回顶部
收藏助手
不良信息举报
您举报文章:android studio错误解决finished with non-zero exit value 1 【javax/xml/namespace/QName.class】
举报原因:
原因补充:

(最多只允许输入30个字)