maven install 报错解决

原创 2016年06月29日 17:53:04

[ERROR] No compiler is provided in this environment. Perhaps you are running on a JRE rather than a JDK?

第一次解决方式是项目右键——>build path——>config build path
然后更改

这里写图片描述

发现问题并没有解决。

然后到Google上搜了一下,看了很多解决方法,终于找到一个比较有用的答案。如下:

大致阅读了一下,说的是执行编译失败,你是不是在JRE环境下运行而不是JDK?闹闹头想了想,JDK已安装、各种环境变量配置木有问题,为什么会出现这种状况呢?寻思了一会儿,知道了原来Eclipse运行是需要一个JRE,而这个JRE并不是系统环境变量中的javac目录下的JRE,而是JDK安装时候自带的JRE目录,此目录下并无javac,故无法进行java的编译,问题找到了,下面说一下具体解决方案。

在Eclipse的菜单中,进入 Window > Preferences > Java > Installed JREs > Execution Environments,选择JavaSE-1.x, 在右侧选择JDK的安装目录(注意不要选择JRE的目录).

这里写图片描述

执行maven clean命令,然后执行maven install,最终问题解决,出现BUILD SUCCESS

版权声明:本文为博主原创文章,未经博主允许不得转载。

maven install 报错解决方案

Failed to execute goal org.apache.maven.plugins:maven-compiler-plugin:3.3:compile
  • u013419080
  • u013419080
  • 2015年12月25日 00:09
  • 3223

eclipse里maven install时,报错提示jdk为无效的目标版本:1.7

报错提示: [ERROR] Failed to execute goal org.apache.maven.plugins:maven-compiler-plugin:2.3.2:compile (d...
  • wabiaozia
  • wabiaozia
  • 2016年06月22日 12:21
  • 6682

Maven项目错误解决小结

Maven项目错误解决小结 注:整理错误,不喜欢为了一个小问题,占篇幅,所以请Ctrl+F自己查看,定位问题,愿为解决. 注:网络上的错误解决经验,只是作者在特定的条件下发生,或者适合你不适合你,请勿...
  • typa01_kk
  • typa01_kk
  • 2015年10月16日 23:27
  • 66007

运行maven install命令时出现错误(BUILD FAILURE)

创建了一个struts与spring集成的项目,运行run as—>maven install时出现以下错误:*******************************************[E...
  • fengyun111999
  • fengyun111999
  • 2010年06月13日 13:42
  • 26507

关于在Elipse中执行maven install 报错的解决方案

今天从别的地方拿到了一个由maven构建的项目的源码,想在自己的机器上部署一下,按照maven项目的打包部署步骤执行到maven install的时候,出现如下错误: [INFO] Scanni...
  • dzjin1234
  • dzjin1234
  • 2018年01月04日 14:28
  • 83

maven install 失败

eclipse中run as maven install失败,信息如下: [INFO] -----------------------------------------------------...
  • danchaofan0534
  • danchaofan0534
  • 2016年08月10日 18:04
  • 3237

spring 项目用maven install打包老报错

最近将公司一个小项目代码复制到家里电脑时,其它都正常,当用maven打包时老报错,后来发现有pom.xml 以下包下载设置有问题       org.apache.maven.plugins   ...
  • builderwfy
  • builderwfy
  • 2016年08月13日 16:38
  • 447

Maven install 出错解决方法

[ERROR] Failed to execute goal org.apache.maven.plugins:maven-install-plugin:2.3.1:install (default-...
  • u011642927
  • u011642927
  • 2015年12月03日 16:40
  • 399

maven install失败

[WARNING] Error injecting: org.apache.maven.plugin.war.WarMojo java.lang.NoClassDefFoundError: org/a...
  • shuige989
  • shuige989
  • 2017年01月04日 13:46
  • 841

maven项目加载时候,install部分包失败

右击pom.xml,run as —> maven install,会看到console中有时报: mavenRepository\repos\org\mortbay\jetty\servlet-a...
  • a510750
  • a510750
  • 2017年05月19日 17:08
  • 313
内容举报
返回顶部
收藏助手
不良信息举报
您举报文章:maven install 报错解决
举报原因:
原因补充:

(最多只允许输入30个字)