关闭

mavencompile编译报错/WorkFlowMQListening.java:[11,32] 找不到符号 符号: 类 MQTools

410人阅读 评论(0) 收藏 举报
分类:
D:\Java\jdk1.8.0_73\bin\java -Dmaven.multiModuleProjectDirectory=$M2_HOME -Dmaven.home=D:\localtools\apache-maven-3.3.9 -Dclassworlds.conf=D:\localtools\apache-maven-3.3.9\bin\m2.conf -Didea.launcher.port=7534 "-Didea.launcher.bin.path=D:\Program Files (x86)\JetBrains\IntelliJ IDEA 14.0.2\bin" -classpath "D:\Program Files (x86)\JetBrains\IntelliJ IDEA 14.0.2\lib\idea_rt.jar;D:\Program Files (x86)\JetBrains\IntelliJ IDEA 14.0.2\lib\util.jar" -Dfile.encoding=UTF-8 com.intellij.rt.execution.CommandLineWrapper C:\Users\Administrator\AppData\Local\Temp\classpath1.tmp com.intellij.rt.execution.application.AppMain org.codehaus.classworlds.Launcher -Didea.version=14.0.2 -s D:\localtools\geoserver\settings.xml -Dmaven.repo.local=D:\localtools\geoserver\repository compile
[INFO] Scanning for projects...
[INFO] ------------------------------------------------------------------------
[INFO] Reactor Build Order:
[INFO] 
[INFO] ffddg
[INFO] DG-Domain
[INFO] DG-Common
[INFO] DG-Server
[INFO] DG-UI
[INFO] DG-Slave
[INFO]                                                                         
[INFO] ------------------------------------------------------------------------
[INFO] Building ffddg 1.1
[INFO] ------------------------------------------------------------------------
[INFO]                                                                         
[INFO] ------------------------------------------------------------------------
[INFO] Building DG-Domain 1.1
[INFO] ------------------------------------------------------------------------
[INFO] 
[INFO] --- maven-resources-plugin:2.6:resources (default-resources) @ DG-Domain ---
[INFO] Using 'UTF-8' encoding to copy filtered resources.
[INFO] Copying 0 resource
[INFO] 
[INFO] --- maven-compiler-plugin:3.3:compile (default-compile) @ DG-Domain ---
[INFO] Nothing to compile - all classes are up to date
[INFO]                                                                         
[INFO] ------------------------------------------------------------------------
[INFO] Building DG-Common 1.1
[INFO] ------------------------------------------------------------------------
[INFO] 
[INFO] --- maven-resources-plugin:2.6:resources (default-resources) @ DG-Common ---
[WARNING] Using platform encoding (UTF-8 actually) to copy filtered resources, i.e. build is platform dependent!
[INFO] Copying 0 resource
[INFO] 
[INFO] --- maven-compiler-plugin:3.3:compile (default-compile) @ DG-Common ---
[INFO] Nothing to compile - all classes are up to date
[INFO]                                                                         
[INFO] ------------------------------------------------------------------------
[INFO] Building DG-Server 1.1
[INFO] ------------------------------------------------------------------------
[INFO] 
[INFO] --- maven-resources-plugin:2.6:resources (default-resources) @ DG-Server ---
[WARNING] Using platform encoding (UTF-8 actually) to copy filtered resources, i.e. build is platform dependent!
[INFO] Copying 72 resources
[INFO] 
[INFO] --- maven-compiler-plugin:3.3:compile (default-compile) @ DG-Server ---
[INFO] Changes detected - recompiling the module!
[WARNING] File encoding has not been set, using platform encoding UTF-8, i.e. build is platform dependent!
[INFO] Compiling 1205 source files to D:\abcd10\2016-04-18\ffddg\DG-Server\target\classes
[INFO] -------------------------------------------------------------
[ERROR] COMPILATION ERROR : 
[INFO] -------------------------------------------------------------
[ERROR] /D:/abcd10/2016-04-18/ffddg/DG-Server/src/main/java/com/tclsoud/gather/utils/workflowlistening/WorkFlowMQListening.java:[11,32] 找不到符号
  符号:   类 MQTools
  位置: 程序包 com.tclsoud.gather.utils
[ERROR] /D:/abcd10/2016-04-18/ffddg/DG-Server/src/main/java/com/tclsoud/gather/service/impl/DataSourceServiceImpl.java:[24,32] 找不到符号
  符号:   类 MQTools
  位置: 程序包 com.tclsoud.gather.utils
[ERROR] /D:/abcd10/2016-04-18/ffddg/DG-Server/src/main/java/com/tclsoud/gather/service/impl/WorkflowListeningServiceImpl.java:[13,32] 找不到符号
  符号:   类 MQTools
  位置: 程序包 com.tclsoud.gather.utils
[ERROR] /D:/abcd10/2016-04-18/ffddg/DG-Server/src/main/java/com/tclsoud/gather/utils/workflowlistening/StartWorkFlowLogMQActor.java:[16,32] 找不到符号
  符号:   类 MQTools
  位置: 程序包 com.tclsoud.gather.utils
[INFO] 4 errors 
[INFO] -------------------------------------------------------------
[INFO] ------------------------------------------------------------------------
[INFO] Reactor Summary:
[INFO] 
[INFO] ffddg ...................................... SUCCESS [  0.002 s]
[INFO] DG-Domain .......................................... SUCCESS [  2.607 s]
[INFO] DG-Common .......................................... SUCCESS [  2.814 s]
[INFO] DG-Server .......................................... FAILURE [ 12.653 s]
[INFO] DG-UI .............................................. SKIPPED
[INFO] DG-Slave ........................................... SKIPPED
[INFO] ------------------------------------------------------------------------
[INFO] BUILD FAILURE
[INFO] ------------------------------------------------------------------------
[INFO] Total time: 18.276 s
[INFO] Finished at: 2017-01-03T12:30:27+08:00
[INFO] Final Memory: 54M/451M
[INFO] ------------------------------------------------------------------------
[ERROR] Failed to execute goal org.apache.maven.plugins:maven-compiler-plugin:3.3:compile (default-compile) on project DG-Server: Compilation failure: Compilation failure:
[ERROR] /D:/abcd10/2016-04-18/ffddg/DG-Server/src/main/java/com/tclsoud/gather/utils/workflowlistening/WorkFlowMQListening.java:[11,32] 找不到符号
[ERROR] 符号:   类 MQTools
[ERROR] 位置: 程序包 com.tclsoud.gather.utils
[ERROR] /D:/abcd10/2016-04-18/ffddg/DG-Server/src/main/java/com/tclsoud/gather/service/impl/DataSourceServiceImpl.java:[24,32] 找不到符号
[ERROR] 符号:   类 MQTools
[ERROR] 位置: 程序包 com.tclsoud.gather.utils
[ERROR] /D:/abcd10/2016-04-18/ffddg/DG-Server/src/main/java/com/tclsoud/gather/service/impl/WorkflowListeningServiceImpl.java:[13,32] 找不到符号
[ERROR] 符号:   类 MQTools
[ERROR] 位置: 程序包 com.tclsoud.gather.utils
[ERROR] /D:/abcd10/2016-04-18/ffddg/DG-Server/src/main/java/com/tclsoud/gather/utils/workflowlistening/StartWorkFlowLogMQActor.java:[16,32] 找不到符号
[ERROR] 符号:   类 MQTools
[ERROR] 位置: 程序包 com.tclsoud.gather.utils
[ERROR] -> [Help 1]
[ERROR] 
[ERROR] To see the full stack trace of the errors, re-run Maven with the -e switch.
[ERROR] Re-run Maven using the -X switch to enable full debug logging.
[ERROR] 
[ERROR] For more information about the errors and possible solutions, please read the following articles:
[ERROR] [Help 1] http://cwiki.apache.org/confluence/display/MAVEN/MojoFailureException
[ERROR] 
[ERROR] After correcting the problems, you can resume the build with the command
[ERROR]   mvn <goals> -rf :DG-Server

Process finished with exit code 1
0
0
查看评论
发表评论
* 以上用户言论只代表其个人观点,不代表CSDN网站的观点或立场

AS 报错 Error:(303, 27) 错误: 找不到符号 符号: 方法 sin(float) 位置: 类 FloatMath

今天更新了sdk,升级到Android SDK 23。发现Android studio用23编译 SlidingMenu时出错,错误如下:        报错的地方这这里: [jav...
  • rongwenbin
  • rongwenbin
  • 2016-04-25 11:14
  • 7326

编译报错+解决方法:错误: 找不到符号

【0】README 1)本文主要解决“错误,找不到符号” 【1】 console error info 1)error :  E:\bench-cluster\mybatis_in_action_...
  • PacosonSWJTU
  • PacosonSWJTU
  • 2016-07-01 23:13
  • 9123

JAVA 编译找不到符号

通常情况下,我们在编写java文件时,会有引用到自已定义的一些类,如果按通常的javac *.java的形式来编译会出现找不到符号的错误。以下提供了两种方法,以供参考假如在d:/web/wsh下有a....
  • shuilan0066
  • shuilan0066
  • 2010-05-27 09:28
  • 21942

一般遇到Error:(14, 9) 错误: 找不到符号 符号: 类 Button 位置: 类 FirstActivity

遇到 Error: 错误: 找不到符号 符号: 类x 位置: 类  xActivity 不慌 先试试   “ALT+ENTER”组合键 一般都能解决 相当于eclipse移动光标在错误修复那...
  • xchaha
  • xchaha
  • 2018-01-06 23:32
  • 62

maven报错:找不到符号

语言:java和scala并用 场景:存在java调用scala代码的情况 maven版本:3.5.1 IDE:IDEA 2017.1maven报错:找不到符号并列出找不到的类或程序所在的程序包...
  • ilvchocolate
  • ilvchocolate
  • 2017-07-21 10:39
  • 1165

Maven 错误找不到符号

Maven 错误找不到符号问题,通常有三种原因: 1. 可能项目编码格式不统一。 2. 可能项目编码使用的JDK版本不统一。 3. pom依赖问题,这种依赖可能是没有添加包的依赖,如果...
  • u012062455
  • u012062455
  • 2016-08-28 18:48
  • 21143

maven 找不到符号

maven 找不到符号
  • tengdazhang770960436
  • tengdazhang770960436
  • 2017-02-04 18:43
  • 2799

maven 错误找不到符号 解决办法

maven 错误找不到符号 解决办法maven cannot find symbo 解决办法如果你已经尝试了网上各种帖子各种解决办法还是没解决此问题,那么认真读一下这篇文章吧,绝对可以解决你的烦恼。我...
  • Java_HYL
  • Java_HYL
  • 2017-02-16 10:41
  • 1496

maven编译项目时报异常,找不到符号

问题:Compilation failure: Compilation failure:找不到符号 解决方法: 1.Maven clean 2.项目右键->Maven->Update Proje...
  • u012945986
  • u012945986
  • 2017-03-29 09:03
  • 673

maven install,compile,或者打包的时候 找不到符号,类 错误

今天在打包的时候  mvn -Pdev clean package -Dmaven.test.skip=true   出现了一系列的错误   由我一一说来 首先我在cmd中执行这个命令 告...
  • u010310183
  • u010310183
  • 2016-05-11 19:56
  • 9698
    个人资料
    • 访问:10812次
    • 积分:389
    • 等级:
    • 排名:千里之外
    • 原创:27篇
    • 转载:8篇
    • 译文:0篇
    • 评论:1条