Kotlin 踩坑日记(五)aapt2 编译 bug

原创 2017年06月01日 09:57:02

前言

常用开发机为Ubuntu 17.04,在升级Android Studio 到3.0.0-Canary2 后,发现之前可以正常编译的Android Kotlin 项目竟然无法编译了,最终发现,是因为aapt2 的问题造成的,并不知道原因,但是估计应该是aapt2的bug吧。。。

Ubuntu下编译Android 项目 aapt2 报错

FAILURE: Build failed with an exception.

* What went wrong:
Execution failed for task ':app:mergeDebugResources'.
> Error: java.lang.NoClassDefFoundError

* Try:
Run with --info or --debug option to get more log output.

* Exception is:
org.gradle.api.tasks.TaskExecutionException: Execution failed for task ':app:mergeDebugResources'.
    at org.gradle.api.internal.tasks.execution.ExecuteActionsTaskExecuter.executeActions(ExecuteActionsTaskExecuter.java:98)
    at org.gradle.api.internal.tasks.execution.ExecuteActionsTaskExecuter.execute(ExecuteActionsTaskExecuter.java:68)
    at org.gradle.api.internal.tasks.execution.SkipUpToDateTaskExecuter.execute(SkipUpToDateTaskExecuter.java:60)
    at org.gradle.api.internal.tasks.execution.ResolveTaskOutputCachingStateExecuter.execute(ResolveTaskOutputCachingStateExecuter.java:54)
    at org.gradle.api.internal.tasks.execution.ValidatingTaskExecuter.execute(ValidatingTaskExecuter.java:58)
    at org.gradle.api.internal.tasks.execution.SkipEmptySourceFilesTaskExecuter.execute(SkipEmptySourceFilesTaskExecuter.java:88)
    at org.gradle.api.internal.tasks.execution.ResolveTaskArtifactStateTaskExecuter.execute(ResolveTaskArtifactStateTaskExecuter.java:52)
    at org.gradle.api.internal.tasks.execution.SkipTaskWithNoActionsExecuter.execute(SkipTaskWithNoActionsExecuter.java:52)
    at org.gradle.api.internal.tasks.execution.SkipOnlyIfTaskExecuter.execute(SkipOnlyIfTaskExecuter.java:54)
    at org.gradle.api.internal.tasks.execution.ExecuteAtMostOnceTaskExecuter.execute(ExecuteAtMostOnceTaskExecuter.java:43)
    at org.gradle.api.internal.tasks.execution.CatchExceptionTaskExecuter.execute(CatchExceptionTaskExecuter.java:34)
    at org.gradle.execution.taskgraph.DefaultTaskGraphExecuter$EventFiringTaskWorker$1.execute(DefaultTaskGraphExecuter.java:248)
    at org.gradle.execution.taskgraph.DefaultTaskGraphExecuter$EventFiringTaskWorker$1.execute(DefaultTaskGraphExecuter.java:239)
    at org.gradle.internal.Transformers$4.transform(Transformers.java:169)
    at org.gradle.internal.progress.DefaultBuildOperationExecutor.run(DefaultBuildOperationExecutor.java:114)
    at org.gradle.internal.progress.DefaultBuildOperationExecutor.run(DefaultBuildOperationExecutor.java:68)
    at org.gradle.execution.taskgraph.DefaultTaskGraphExecuter$EventFiringTaskWorker.execute(DefaultTaskGraphExecuter.java:239)
    at org.gradle.execution.taskgraph.DefaultTaskGraphExecuter$EventFiringTaskWorker.execute(DefaultTaskGraphExecuter.java:226)
    at org.gradle.execution.taskgraph.DefaultTaskPlanExecutor$TaskExecutorWorker.processTask(DefaultTaskPlanExecutor.java:120)
    at org.gradle.execution.taskgraph.DefaultTaskPlanExecutor$TaskExecutorWorker.access$200(DefaultTaskPlanExecutor.java:77)
    at org.gradle.execution.taskgraph.DefaultTaskPlanExecutor$TaskExecutorWorker$1.execute(DefaultTaskPlanExecutor.java:101)
    at org.gradle.execution.taskgraph.DefaultTaskPlanExecutor$TaskExecutorWorker$1.execute(DefaultTaskPlanExecutor.java:95)
    at org.gradle.execution.taskgraph.DefaultTaskExecutionPlan.executeWithTask(DefaultTaskExecutionPlan.java:527)
    at org.gradle.execution.taskgraph.DefaultTaskPlanExecutor$TaskExecutorWorker.run(DefaultTaskPlanExecutor.java:95)
    at org.gradle.internal.concurrent.ExecutorPolicy$CatchAndRecordFailures.onExecute(ExecutorPolicy.java:63)
    at org.gradle.internal.concurrent.StoppableExecutorImpl$1.run(StoppableExecutorImpl.java:46)
    at org.gradle.internal.concurrent.ThreadFactoryImpl$ManagedThreadRunnable.run(ThreadFactoryImpl.java:55)
Caused by: com.android.build.gradle.tasks.ResourceException: Error: java.lang.NoClassDefFoundError
    at com.android.build.gradle.tasks.MergeResources.doFullTaskAction(MergeResources.java:201)
    at com.android.build.gradle.internal.tasks.IncrementalTask.taskAction(IncrementalTask.java:80)
    at org.gradle.internal.reflect.JavaMethod.invoke(JavaMethod.java:73)
    at org.gradle.api.internal.project.taskfactory.DefaultTaskClassInfoStore$IncrementalTaskAction.doExecute(DefaultTaskClassInfoStore.java:161)
    at org.gradle.api.internal.project.taskfactory.DefaultTaskClassInfoStore$StandardTaskAction.execute(DefaultTaskClassInfoStore.java:132)
    at org.gradle.api.internal.project.taskfactory.DefaultTaskClassInfoStore$StandardTaskAction.execute(DefaultTaskClassInfoStore.java:121)
    at org.gradle.api.internal.tasks.execution.ExecuteActionsTaskExecuter$1.execute(ExecuteActionsTaskExecuter.java:115)
    at org.gradle.api.internal.tasks.execution.ExecuteActionsTaskExecuter$1.execute(ExecuteActionsTaskExecuter.java:109)
    at org.gradle.internal.Transformers$4.transform(Transformers.java:169)
    at org.gradle.internal.progress.DefaultBuildOperationExecutor.run(DefaultBuildOperationExecutor.java:114)
    at org.gradle.internal.progress.DefaultBuildOperationExecutor.run(DefaultBuildOperationExecutor.java:63)
    at org.gradle.api.internal.tasks.execution.ExecuteActionsTaskExecuter.executeAction(ExecuteActionsTaskExecuter.java:109)
    at org.gradle.api.internal.tasks.execution.ExecuteActionsTaskExecuter.executeActions(ExecuteActionsTaskExecuter.java:90)
    ... 26 more
Caused by: Error: java.lang.NoClassDefFoundError
    at com.android.ide.common.res2.MergedResourceWriter.postWriteAction(MergedResourceWriter.java:596)
    at com.android.ide.common.res2.MergeWriter.end(MergeWriter.java:45)
    at com.android.ide.common.res2.MergedResourceWriter.end(MergedResourceWriter.java:237)
    at com.android.ide.common.res2.DataMerger.mergeData(DataMerger.java:301)
    at com.android.ide.common.res2.ResourceMerger.mergeData(ResourceMerger.java:412)
    at com.android.build.gradle.tasks.MergeResources.doFullTaskAction(MergeResources.java:194)
    ... 38 more
Caused by: java.util.concurrent.ExecutionException: java.lang.NoClassDefFoundError
    at com.android.ide.common.res2.MergedResourceWriter.postWriteAction(MergedResourceWriter.java:564)
    ... 43 more
Caused by: java.lang.NoClassDefFoundError
    ... 44 more
Caused by: java.lang.NoClassDefFoundError: Could not initialize class com.android.tools.aapt2.Aapt2Jni
    at com.android.builder.internal.aapt.v2.AaptV2Jni.lambda$compile$0(AaptV2Jni.java:90)

使用–stacktrace参数编译后,提示该错误。

解决

在项目gradle.properties文件中添加

android.enableAapt2=false

关闭aapt2的编译,即可

版权声明: 版权声明:本文为博主原创文章,如需转载请在文章中注明“转载”并在文章开头附上本博客链接。

Android Studio 2.3、3.0 升级后问题解决

解决Android Studio升级2.3、3.0版本或者导入别人的项目于一直处于Building 'xxx' Gradle project info的问题、以及:app:mergeDebugReso...
  • ww897532167
  • ww897532167
  • 2017年01月19日 16:03
  • 6605

分析apk工具aapt的使用,解析其原理

通过apktool我们的确可以反编译已经序列化后的AndroidManifest.xml和资源文件等等,但是有没有一种快速有效的工具在不解包的前提下可以获得某一apk的基本内容、权限以及该apk的基本...
  • u011075946
  • u011075946
  • 2015年06月17日 15:32
  • 1192

kotlin和DataBinding一起使用踩坑日记

kotlin和databinding一起使用,各种坑
  • u011369424
  • u011369424
  • 2017年05月28日 18:06
  • 2703

Kotlin 踩坑日记(四) Maven Google 仓库 gradle 使用

Maven Google 仓库因为Android studio 3.0.0 将gradle build tools 、support 、design 等依赖库发布在了自己的maven.google.c...
  • soslinken
  • soslinken
  • 2017年05月31日 14:55
  • 4447

Kotlin 学习笔记之 Long 的坑。BUG 乎?

Long 数据类型占用内存空间 2^64,即可以表示-2^63 ~ 2^63-1 的整型数字。代码:fun main(args: Array) { println(Long.MIN_VALUE...
  • Mingyueyixi
  • Mingyueyixi
  • 2017年09月26日 11:14
  • 261

微信开发学习日记(五):weiphp开源框架的bug,公众号权限编辑问题

最近在研究weiphp,总体感觉还行,bug据说还挺多。这不,我就遇到一个比较严重影响使用的。感觉不太应该出现这么严重的bug啊。   weiphp的微信公众号等级,权限增加和编辑bug,看不到权限列...
  • FansUnion
  • FansUnion
  • 2015年04月14日 10:15
  • 2477

Uiautomator2-aapt.exe

  • 2017年12月28日 09:30
  • 5.21MB
  • 下载

android aapt-v24 源代码工程编译

  • 2016年12月09日 12:39
  • 4.72MB
  • 下载

深入了解aapt对自动编译生成apk

  • 2014年05月19日 17:48
  • 3KB
  • 下载

如何脱离Android源码环境编译aapt

由于要修改aapt源码,所以clone了一份android源码,无奈mac的ssd只有256G,所以把源码下到了虚拟机里,这个虚拟机在移动硬盘中,系统是ubuntu的,编译linux和windows版...
  • sbsujjbcy
  • sbsujjbcy
  • 2016年06月08日 14:15
  • 2436
内容举报
返回顶部
收藏助手
不良信息举报
您举报文章:Kotlin 踩坑日记(五)aapt2 编译 bug
举报原因:
原因补充:

(最多只允许输入30个字)