RT73 install failure

原创 2006年06月20日 00:53:00
ubuntu 5.10
kernel 2.6.17

windy@windy:~/RT73_Linux_STA_Drv1.0.3.0/Module$ sudo make all
make -C /lib/modules/2.6.17/build SUBDIRS=/home/windy/RT73_Linux_STA_Drv1.0.3.0/Module modules
make[1]: Entering directory `/usr/src/linux-2.6.17'
  CC [M]  /home/windy/RT73_Linux_STA_Drv1.0.3.0/Module/rtmp_main.o
In file included from /home/windy/RT73_Linux_STA_Drv1.0.3.0/Module/rt_config.h:174,
                 from /home/windy/RT73_Linux_STA_Drv1.0.3.0/Module/rtmp_main.c:40:
/home/windy/RT73_Linux_STA_Drv1.0.3.0/Module/oid.h:256:5: warning: "DBG" is not defined
In file included from /home/windy/RT73_Linux_STA_Drv1.0.3.0/Module/rt_config.h:178,
                 from /home/windy/RT73_Linux_STA_Drv1.0.3.0/Module/rtmp_main.c:40:
/home/windy/RT73_Linux_STA_Drv1.0.3.0/Module/rtmp.h:2856:5: warning: "DBG" is not defined
/home/windy/RT73_Linux_STA_Drv1.0.3.0/Module/rtmp_main.c:105: 错误:初始值设定项里有未知的字段 ‘owner’
/home/windy/RT73_Linux_STA_Drv1.0.3.0/Module/rtmp_main.c:105: 警告:从不兼容的指针类型初始化
/home/windy/RT73_Linux_STA_Drv1.0.3.0/Module/rtmp_main.c:1315:5: warning: "DBG" is not defined
make[2]: *** [/home/windy/RT73_Linux_STA_Drv1.0.3.0/Module/rtmp_main.o] 错误 1
make[1]: *** [_module_/home/windy/RT73_Linux_STA_Drv1.0.3.0/Module] 错误 2
make[1]: Leaving directory `/usr/src/linux-2.6.17'
make: *** [all] 错误 2

Assertion failure in -[MASViewConstraint install]

今天敲代码,遇到了一个BUG,控制台输出的错误如下: *** Assertion failure in -[MASViewConstraint install], /Users/mac/Desktop...
  • sophia_xiaoma
  • sophia_xiaoma
  • 2015年12月05日 16:21
  • 4455

adb install 安装apk过程中报错Failure [INSTALL_FAILED_UPDATE_INCOMPATIBLE]

错误描述:通过adb install 安装apk的过程中 Failure [INSTALL_FAILED_UPDATE_INCOMPATIBLE],造成这个的原因可能是之前多次安装过,卸载不彻底造成的...
  • TheMeLove
  • TheMeLove
  • 2016年10月09日 18:59
  • 1297

Assertion failure in -[MASViewConstraint install],/xxx/Pods/Masonry/Masonry/MASViewConstraint.m:338

Assertion failure in -[MASViewConstraint install],/xxx/Pods/Masonry/Masonry/MASViewConstraint.m:338 ...
  • mgr406176009
  • mgr406176009
  • 2017年04月06日 15:56
  • 1018

android 安装失败 Failure [INSTALL_CANCELED_BY_USER]

手机系统升级了,每次安装失败 ,  开启手机开发者模式,在开发者选择中打开容许use安装  应用...
  • hekai7217
  • hekai7217
  • 2016年12月27日 11:51
  • 4188

提示:Failure [INSTALL_FAILED_ALREADY_EXISTS]

提示:Failure [INSTALL_FAILED_ALREADY_EXISTS] eclipse自动打包是debug的签名,而我打如果是release签名就会出现上面的报错。 解决办法:adb...
  • qingzijin2010
  • qingzijin2010
  • 2016年04月19日 11:45
  • 654

运行maven install命令时出现错误(BUILD FAILURE)

创建了一个struts与spring集成的项目,运行run as—>maven install时出现以下错误:*******************************************[E...
  • fengyun111999
  • fengyun111999
  • 2010年06月13日 13:42
  • 26499

Android issue: adb install … 发生异常 [INSTALL_FAILED_TEST_ONLY: installPackageLI

apk不能用build目录运行时生成的, 需要使用 gradle打包命令生成的apk文件。注意检查gradle的版本,不能是alpha等非release版本注意检测manifest.xml , 上面的...
  • jjwwmlp456
  • jjwwmlp456
  • 2017年11月11日 12:00
  • 1371

adb 安装出现 Failure [INSTALL_FAILED_VERIFICATION_FAILURE] 的解决方法

对于有些手机,比如 Lenevo A808t,在用 adb install -r 安装 apk 包时,会报如下错误,Failure [INSTALL_FAILED_VERIFICATION_FAILU...
  • liangjiu2009
  • liangjiu2009
  • 2017年11月01日 11:32
  • 566

Android Failure [INSTALL_FAILED_VERSION_DOWNGRADE]解决方案

在安装APK过程中,因为VersionName(版本)过程中,因为现安装的版本低于你机器版本,所以会出现Android Failure [INSTALL_FAILED_VERSION_DOWNGRAD...
  • hyjecjtu
  • hyjecjtu
  • 2013年12月30日 11:28
  • 8568

Failure [INSTALL_FAILED_ALREADY_EXISTS]

1、发生原因 做unity开发的同事说apk无法安装,要我帮忙看下,然后我通过命令adb install安装apk,出现此提示 2、解决过程 首先想到的仍然是安装包已存在的问题,结果使用清理类软...
  • u012398365
  • u012398365
  • 2016年02月19日 16:12
  • 7144
内容举报
返回顶部
收藏助手
不良信息举报
您举报文章:RT73 install failure
举报原因:
原因补充:

(最多只允许输入30个字)