关于uiautomator的build.xml不能编译的问题

原创 2016年08月30日 20:01:57

今天在学习uiautomator测试框架的时候,遇到了一个问题:不能对build.xml文件进行编译。查阅网上很多资料,没什么相关的文章,也没有有效解决的办法,在这里分享一下我的解决方法,希望对有的朋友有所帮助。

在uiautomator的工程中,我加入了数据库,想要通过数据库来提升测试脚本的逼格,然而,偷鸡不成蚀把米。遇到了如下的报错。

这是因为我加入了jdbc的包:MySQL-connect-java。然后调用了PC端的数据库。然后就一直不能成功对build.xml文件进行编译了。

我想是因为uiautomator测试框架不能利用数据库进行编写脚本,即使能利用,我们把生成的jar包push到手机上了,手机也不找到PC端的数据库了吧!


还有一个地方:如果你的语法有问题,通过了编译,也不能build成功。就像这样 if(String temp == "123456"){}  这样的语法,可以通过编译,但是你build时也会不通过。

这个就不知道为什么了,如果你们遇到相似的问题,欢迎评论。大家一起探讨!


控制台的报错信息如下:

BUILD FAILED
D:\environment\adt-bundle-windows-x86_64-20140702\sdk\tools\ant\uibuild.xml:183: Compile failed; see the compiler error output for details.

uibuild.xml

  • 2017年07月26日 19:50
  • 11KB
  • 下载

终于编译出android的build.xml啦

转载地址:点击打开链接
  • zouchengxufei
  • zouchengxufei
  • 2014年06月19日 23:09
  • 1922

Android UiAutomator编译与运行测试代码

测试用例已经编写好了,那么怎么编译和运行呢?各位接着往下看吧~~ 1.创建build文件 cmd下运行以下代码进行build文件创建 android create uitest-project -n ...
  • lihongjian944043440
  • lihongjian944043440
  • 2015年12月16日 13:15
  • 2065

UiAutomator中引入第三方库编译和打包问题

这是我使用中遇到的情况,加入了json.jar的引用,结果发现这个包里面的类和android.jar里面的JSONObject类出现了冲突,在Eclipse中,设置jar的顺序可以把报错问题解决掉,但...
  • aman1111
  • aman1111
  • 2017年05月11日 21:22
  • 319

Eclipse启动时DDMS files not found: D:\Eclipse\adt-bundle-windows-x86_64-20131030\sdk\tool

在eclipse中启动新建的android项目的时候,控制台提示如图: 方法1.cmd中adb kill-server,然后adb -startserver 方法2.方法1不管用,那么在任...
  • chaoyu168
  • chaoyu168
  • 2015年10月10日 09:52
  • 16492

android uiautomator学习(一)创建工程

要写UIAutomator的testcase,首先要用Eclipse创建一个Java Project 需要将Junit 的lib加入到工程里 还要添加android.jar和uiautom...
  • robinzhou
  • robinzhou
  • 2012年12月28日 15:18
  • 41936

UiAutomator自动化测试之创建build.xml文件

在学习UiAutomator自动化测试创建build.xml文件时,出现以下问题:这个问题是指-t 后面的android targets id,也就是如图上的“1,应该是对应api 16 或者在api...
  • crystalddd
  • crystalddd
  • 2017年06月17日 14:19
  • 574

cocos2dx 编译错误 BUILD FAILEDG:\android\SDK\android-sdk-windows\tools\ant\build.xml:645: The following

BUILD FAILEDG:\android\SDK\android-sdk-windows\tools\ant\build.xml:645: The following erroroccurred ...
  • u_1_n_2_i_3
  • u_1_n_2_i_3
  • 2014年05月13日 15:52
  • 3014

no classfiles specifiedBUILD FAILED C:\Android\sdk\tools\ant\uibuild.xml:198: null returned: 1 解决方案

[dx] no classfiles specifiedBUILD FAILED C:\Android\sdk\tools\ant\uibuild.xml:198: null returned: 1 ...
  • woshisiyecao
  • woshisiyecao
  • 2017年09月06日 15:41
  • 536

Cannot find D:\Program Files (x86)\Android\android-sdk\tools\ant\uibuild.xml

转自VC错误:http://www.vcerror.com/?p=2175 问题描述: 在做Android uiautomator的时候,从网上下载了一个例子UIAutomatorTestCase...
  • swanabin
  • swanabin
  • 2016年07月16日 15:55
  • 1733
内容举报
返回顶部
收藏助手
不良信息举报
您举报文章:关于uiautomator的build.xml不能编译的问题
举报原因:
原因补充:

(最多只允许输入30个字)