编译安装openssl报错:POD document had syntax errors at /usr/bin/pod2man line 69. make: *** [install_docs]

原创 2016年08月07日 22:55:13

错误如下:

cms.pod around line 457: Expected text after =item, not a number
cms.pod around line 461: Expected text after =item, not a number
cms.pod around line 465: Expected text after =item, not a number
cms.pod around line 470: Expected text after =item, not a number
cms.pod around line 474: Expected text after =item, not a number
POD document had syntax errors at /usr/bin/pod2man line 69.
make: *** [install_docs] Error 1

解决方法
执行:

rm -f /usr/bin/pod2man 

重新编译安装即可。

版权声明:本文为博主原创文章,未经博主允许不得转载。

相关文章推荐

自建证书配置HTTPS服务器

说明 1、写这篇博客的初衷是因为最近iOS9出来了,苹果官方默认要求使用HTTPS,所以自己想整一个HTTPS服务器,也想好好了解一下HTTPS通信,也知道了HTTPS其实就是在HTTP的基础上...
  • PZ0605
  • PZ0605
  • 2016年07月19日 13:03
  • 14095

编译和安装openssl时出错,POD document had syntax errors

installing man1/smime.1   smime.pod around line 272: Expected text after =item, not a number   smi...

安装openssl ERROR:POD document had syntax errors at /usr/bin/pod2man line 71

installing man1/cms.1 cms.pod around line 457: Expected text after =item, not a number cms.pod aro...

关于-/bin/sh:xx(命令) not found 的几种原因和解决办法

编写背后:昨天移植无线网卡到mini2440基本完成到最后一步:用命令:iwlist scanning  搜索网络时串口终端却出现了 -/bin/sh: iwlist  not  found ,后来请...

嵌入式 移植FTP到ARM2410

1.       下载源码交叉编译 vsftpd 官方网站:http://vsftpd.beasts.org/ 目前最新的是2.1.0 修改Makefile中编译器的CC宏, ...
  • skdkjxy
  • skdkjxy
  • 2014年09月04日 15:28
  • 1911

关于Windows、linux跨平台的一些建议

在你做跨平台开发时,难免会遇到一些因操作系统特性带来的麻烦。本文集聚部分,并以Windows,linux为目标平台分析。由于java,Python等语言基本锁定自家编译器、IDE,也就没有C/C++这...

osx升级到10.10后,用pod install报错最终解决办法

摘抄他人博客+个人的一些BUG fix 先按照这个文章做:http://blog.csdn.net/dqjyong/article/details/37958067  大概...

osx升级到10.10后,用pod install报错最终解决办法

先按照这个文章做:http://blog.csdn.net/dqjyong/article/details/37958067 大概步骤如下: Open Xcode 6Open Pref...

ubuntu时区设置,tzselect 报错/usr/bin/tzselect: line 171:/home/ubuntu/iso3166.tab: No such file or direct

Windows宿主上安装的虚拟机Ubuntu14.0.4时间是总是和宿主机时间相差16小时,这样总是会使某些程序由于时间问题报错。 时区问题...

xcode8.3.3模拟器编译报错Command /usr/bin/codesign failed with exit code 1

前段时间测试机升级10.3.2,无奈只能将xcode8.2.1升级到8.3,但是问题出现了 刚开始我是把xcode8.2留着,下了一个xcode8.3的包手动解压,但是电脑上存在两个xcode就会出现...
内容举报
返回顶部
收藏助手
不良信息举报
您举报文章:编译安装openssl报错:POD document had syntax errors at /usr/bin/pod2man line 69. make: *** [install_docs]
举报原因:
原因补充:

(最多只允许输入30个字)