公司名称后缀 Inc. Co.,Ltd.

版权声明:starRTC免费im直播会议一对一视频,by elesos.com & starRTC.com https://blog.csdn.net/elesos/article/details/80692125
Inc. = Incorporated



Co.,Ltd."连在一起为Company Limited,就是有限公司,或者有限责任公司。“Co”后面的“.”是英文中表示词语短缩省略的符号,而“Co.” 后面的“,”则是用来区分前后两个词的分离号





一个公司如果上市或者比较大了,都会在公司名称的后缀上加Inc.




LLC.全拼是Limited-liability company,即有限责任公司


Corp.全拼是Corporation,即财团,集团,机构

corporation主要是用于大公司,大集团的后缀,比如中国移动集团,阿里巴巴集团。

参考:
阅读更多

Ubuntu14.04 and Debian 8.1, the Realtek Semiconductor Co., Ltd. RTS5209 driver

08-19

For a long time I get a SD Card driver problem in Ubuntu14.04, I want to solve it in recent days, although, it's not really a big problem.rnrnI've RTFM for a while, but, it seems nothing change.rnrnI wish get your help, if you can. I will certenly appreciate it.rnrnThose are my tried records, just list below:rnrnrn[code=text]rn~$ lspci -vrnrn......(omit output)rnrn04:00.0 Unassigned class [ff00]: Realtek Semiconductor Co., Ltd. RTS5209 PCI Express Card Reader (rev 01)rn Subsystem: Acer Incorporated [ALI] Device 0696rn Flags: bus master, fast devsel, latency 0, IRQ 50rn Memory at f0101000 (32-bit, non-prefetchable) [size=4K]rn Expansion ROM at f0000000 [disabled] [size=64K]rn Capabilities: rn Kernel driver in use: rtsx_pcirnrn[/code]rnrnI've downloaded source code from [url=http://www.realtek.com.tw/Downloads/downloadsView.aspx?Langid=3&PNid=15&PFid=25&Level=4&Conn=3&DownTypeID=3&GetDown=false]rtsx[/url]rnrn[code=text]rn~$ tar jvxf 0001-rts_pstor.tar.bz2rn~/rts_pstor$ cd rts_pstorrn~/rts_pstor$ less README.txtrnGeneral Informationrn===================rnrnLinux driver for Realtek PCI-Express card reader chip.rnrnrnBuild Stepsrn===========rnrn1) makern2) make installrn3) depmodrn4) reboot your computerrnrnNote: Root privilege is required in step 2 and 3rnrn~/rts_pstor$ sudo makern[sudo] password for bdg: rnsed "s/RTSX_MK_TIME/`date +%y.%m.%d.%H.%M`/" timestamp.in > timestamp.hrncp -f ./define.release ./define.hrnmake -C /lib/modules/3.13.0-61-generic/build/ SUBDIRS= modulesrnmake[1]: Entering directory `/usr/src/linux-headers-3.13.0-61-generic'rn HOSTCC scripts/basic/fixdeprn HOSTCC scripts/kconfig/conf.orn HOSTCC scripts/kconfig/zconf.tab.orn HOSTLD scripts/kconfig/confrnscripts/kconfig/conf --silentoldconfig Kconfigrnmake[1]: Leaving directory `/usr/src/linux-headers-3.13.0-61-generic'rnmake[1]: Entering directory `/usr/src/linux-headers-3.13.0-61-generic'rnmake[2]: *** No rule to make target `/usr/src/linux-headers-3.13.0-61-generic/arch/x86/syscalls/syscall_32.tbl', needed by `arch/x86/syscalls/../include/generated/uapi/asm/unistd_32.h'. Stop.rnmake[1]: *** [archheaders] Error 2rnmake[1]: Leaving directory `/usr/src/linux-headers-3.13.0-61-generic'rnmake: *** [default] Error 2rnrn~/rts_pstor$ sudo surn~/rts_pstor# makernsed "s/RTSX_MK_TIME/`date +%y.%m.%d.%H.%M`/" timestamp.in > timestamp.hrncp -f ./define.release ./define.hrnmake -C /lib/modules/3.13.0-61-generic/build/ SUBDIRS=/home/bdg/Downloads/tmp/rts_pstor modulesrnmake[1]: Entering directory `/usr/src/linux-headers-3.13.0-61-generic'rn CC [M] /home/bdg/Downloads/tmp/rts_pstor/rtsx.orn/home/bdg/Downloads/tmp/rts_pstor/rtsx.c:275:2: error: unknown field ‘proc_info’ specified in initializerrn .proc_info = proc_info,rn ^rn/home/bdg/Downloads/tmp/rts_pstor/rtsx.c:275:2: warning: initialization from incompatible pointer type [enabled by default]rn/home/bdg/Downloads/tmp/rts_pstor/rtsx.c:275:2: warning: (near initialization for ‘rtsx_host_template.proc_dir’) [enabled by default]rn/home/bdg/Downloads/tmp/rts_pstor/rtsx.c:916:22: error: expected ‘=’, ‘,’, ‘;’, ‘asm’ or ‘__attribute__’ before ‘rtsx_probe’rn static int __devinit rtsx_probe(struct pci_dev *pci, const struct pci_device_id *pci_id)rn ^rn/home/bdg/Downloads/tmp/rts_pstor/rtsx.c:1080:23: error: expected ‘=’, ‘,’, ‘;’, ‘asm’ or ‘__attribute__’ before ‘rtsx_remove’rn static void __devexit rtsx_remove(struct pci_dev *pci)rn ^rn/home/bdg/Downloads/tmp/rts_pstor/rtsx.c:1106:11: error: ‘rtsx_probe’ undeclared here (not in a function)rn .probe = rtsx_probe,rn ^rn/home/bdg/Downloads/tmp/rts_pstor/rtsx.c:1107:2: error: implicit declaration of function ‘__devexit_p’ [-Werror=implicit-function-declaration]rn .remove = __devexit_p(rtsx_remove),rn ^rn/home/bdg/Downloads/tmp/rts_pstor/rtsx.c:1107:24: error: ‘rtsx_remove’ undeclared here (not in a function)rn .remove = __devexit_p(rtsx_remove),rn ^rn/home/bdg/Downloads/tmp/rts_pstor/rtsx.c:485:12: warning: ‘rtsx_control_thread’ defined but not used [-Wunused-function]rn static int rtsx_control_thread(void * __dev)rn ^rn/home/bdg/Downloads/tmp/rts_pstor/rtsx.c:596:12: warning: ‘rtsx_polling_thread’ defined but not used [-Wunused-function]rn static int rtsx_polling_thread(void * __dev)rn ^rn/home/bdg/Downloads/tmp/rts_pstor/rtsx.c:745:13: warning: ‘quiesce_and_remove_host’ defined but not used [-Wunused-function]rn static void quiesce_and_remove_host(struct rtsx_dev *dev)rn ^rn/home/bdg/Downloads/tmp/rts_pstor/rtsx.c:780:13: warning: ‘release_everything’ defined but not used [-Wunused-function]rn static void release_everything(struct rtsx_dev *dev)rn ^rn/home/bdg/Downloads/tmp/rts_pstor/rtsx.c:790:12: warning: ‘rtsx_scan_thread’ defined but not used [-Wunused-function]rn static int rtsx_scan_thread(void * __dev)rn ^rn/home/bdg/Downloads/tmp/rts_pstor/rtsx.c:816:13: warning: ‘rtsx_init_options’ defined but not used [-Wunused-function]rn static void rtsx_init_options(struct rtsx_chip *chip)rn ^rncc1: some warnings being treated as errorsrnmake[2]: *** [/home/bdg/Downloads/tmp/rts_pstor/rtsx.o] Error 1rnmake[1]: *** [_module_/home/bdg/Downloads/tmp/rts_pstor] Error 2rnmake[1]: Leaving directory `/usr/src/linux-headers-3.13.0-61-generic'rnmake: *** [default] Error 2rnrn[/code]rnrnI got this reference to modify rtsx.c : [url=https://dainaccio.wordpress.com/2013/07/14/realtek-sd-reader-mounting-problems-under-linux-mintubuntu/]https://dainaccio.wordpress.com/2013/07/14/realtek-sd-reader-mounting-problems-under-linux-mintubuntu/[/url]rnrndo those changes: rnrnstatic void __devexit rtsx_remove(struct pci_dev *pci) => static void rtsx_remove(struct pci_dev *pci)rnrnstatic int __devinit rtsx_probe(struct pci_dev *pci, const struct pci_device_id *pci_id) => static int rtsx_probe(struct pci_dev *pci, const struct pci_device_id *pci_id)rnrn.remove = __devexit_p(rtsx_remove), => .remove = rtsx_remove,rnrnthere was still a problem at line 275, I commented it. And yes compile passed.rnrn[code=text]rnrn~/rts_pstor# depmodrn~/rts_pstor# reboot now rnrnrn~$ lcpci -vrnrn04:00.0 Unassigned class [ff00]: Realtek Semiconductor Co., Ltd. RTS5209 PCI Express Card Reader (rev 01)rn Subsystem: Acer Incorporated [ALI] Device 0696rn Flags: bus master, fast devsel, latency 0, IRQ 50rn Memory at f0101000 (32-bit, non-prefetchable) [size=4K]rn Expansion ROM at f0000000 [disabled] [size=64K]rn Capabilities: [40] Power Management version 3rn Capabilities: [50] MSI: Enable+ Count=1/1 Maskable- 64bit+rn Capabilities: [70] Express Endpoint, MSI 00rn Capabilities: [100] Advanced Error Reportingrn Capabilities: [140] Device Serial Number 00-00-00-01-00-4c-e0-00rn Kernel driver in use: rtsx_pcirnrn[/code]rnrnwhat show i DO?rnrn[code=text]rn~$ uname -a rnrnLinux Bulbul 3.13.0-61-generic #100-Ubuntu SMP Wed Jul 29 11:21:34 UTC 2015 x86_64 x86_64 x86_64 GNU/Linuxrn[/code]

没有更多推荐了,返回首页