error HLP: Help compilation failed with code 1

展开阅读全文

dbx error: error code: -1

11-08

用dbexpress 连接oracle出现下面错误,改怎么解决rndbx error: error code: -1rn详细情况:rn[0F30CB25]DbxCommonDriver120.bpl Dbxcommon.TDBXContext.Error + $51rn[0F3248D0]DbxCommonDriver120.bpl Dbxdynalink.TDBXMethodTable.RaiseError + $10Crn[0F324F0F]DbxCommonDriver120.bpl Dbxdynalink.TDBXDynalinkConnection.CheckResult + $13rn[0F325100]DbxCommonDriver120.bpl Dbxdynalink.TDBXDynalinkConnection.DerivedOpen + $50rn[0F308F4F]DbxCommonDriver120.bpl Dbxcommon.TDBXConnection.Open + $7rn[0F3042D1]DbxCommonDriver120.bpl Dbxcommon.TDBXConnectionFactory.GetConnection + $F5rn[0F3041D5]DbxCommonDriver120.bpl Dbxcommon.TDBXConnectionFactory.GetConnection + $5rn[50AB8A3B]dbexpress120.bpl SqlExpr.TSQLConnection.DoConnect (Line 2528, "..\..\..\..\..\src\pas\dbx\vcl\SqlExpr.pas" + 53) + $5rn[50483579]dbrtl120.bpl DB.TCustomConnection.SetConnected (Line 3064, "DB.pas" + 8) + $4rn[5003EA46]rtl120.bpl TypInfo.SetOrdProp (Line 1502, "TypInfo.pas" + 27) + $0rn[20B9ACF2]designide120.bpl DesignEditors.TPropertyEditor.SetOrdValue (Line 838, "DesignEditors.pas" + 2) + $Ern[20B9BDFB]designide120.bpl DesignEditors.TEnumProperty.SetValue (Line 1398, "DesignEditors.pas" + 5) + $4rn[20B9A961]designide120.bpl DesignEditors.TPropertyEditor.Edit (Line 668, "DesignEditors.pas" + 11) + $14rn[208AAF82]coreide120.bpl PropInsp.TPropertyInspector.PropListEditDblClick (Line 882, "PropInsp.pas" + 20) + $5rn[20C87371]vclide120.bpl IDEInspListBox.TInspListBox.DoEditDblClick (Line 976, "IDEInspListBox.pas" + 2) + $Arn[20C88BB2]vclide120.bpl IDEInspListBox.TInspListBox.EditDblClick (Line 1546, "IDEInspListBox.pas" + 0) + $2rn[501D1181]vcl120.bpl Controls.TControl.DblClick (Line 6761, "Controls.pas" + 1) + $14rn[501D12E4]vcl120.bpl Controls.TControl.WMLButtonDblClk (Line 6804, "Controls.pas" + 4) + $Crn[501D0BFA]vcl120.bpl Controls.TControl.WndProc (Line 6640, "Controls.pas" + 91) + $6rn[501D5287]vcl120.bpl Controls.TWinControl.WndProc (Line 9334, "Controls.pas" + 136) + $6rn[501DD246]vcl120.bpl Controls.TDockTree.WndProc (Line 14467, "Controls.pas" + 74) + $5rn[50046C98]rtl120.bpl Classes.TThreadList.UnlockList (Line 3781, "Classes.pas" + 0) + $4rn[5012C8FC]vcl120.bpl Graphics.FreeMemoryContexts (Line 6830, "Graphics.pas" + 12) + $5rn[501D4BE0]vcl120.bpl Controls.TWinControl.IsControlMouseMsg (Line 9127, "Controls.pas" + 9) + $25rn[501D5287]vcl120.bpl Controls.TWinControl.WndProc (Line 9334, "Controls.pas" + 136) + $6rn[20C86513]vclide120.bpl IDEInspListBox.TPropInspEdit.WndProc (Line 439, "IDEInspListBox.pas" + 7) + $4rn[501D49A0]vcl120.bpl Controls.TWinControl.MainWndProc (Line 9063, "Controls.pas" + 3) + $6rn[50057E04]rtl120.bpl Classes.StdWndProc (Line 12723, "Classes.pas" + 8) + $0rn[501CB982]vcl120.bpl Controls.FindControl (Line 2997, "Controls.pas" + 6) + $9rn[501F9EAB]vcl120.bpl Forms.TApplication.ProcessMessage (Line 9613, "Forms.pas" + 23) + $1rn[501F9EEE]vcl120.bpl Forms.TApplication.HandleMessage (Line 9643, "Forms.pas" + 1) + $4rn[501FA219]vcl120.bpl Forms.TApplication.Run (Line 9780, "Forms.pas" + 26) + $3rn[004259D2]bds.exe bds.bds (Line 196, "" + 7) + $7rn 论坛

Compilation Error 网站编译错误

09-05

.Net 4.0 网站挂到外网服务器报错 求解决办法 谢谢了。rnServer Error in '/' Application.rn--------------------------------------------------------------------------------rnrnCompilation Error rnDescription: An error occurred during the compilation of a resource required to service this request. Please review the following specific error details and modify your source code appropriately. rnrnCompiler Error Message: CS0002: Unable to load message string from resources.rnrnSource Error:rnrn rnrn[No relevant source lines]rn rnrnSource File: Line: 0 rnrnrnrnShow Detailed Compiler Output:rnrnrnc:\windows\system32\inetsrv> "C:\WINDOWS\Microsoft.NET\Framework\v4.0.30319\csc.exe" /t:library /utf8output /R:"C:\WINDOWS\Microsoft.Net\assembly\GAC_MSIL\System.Runtime.Serialization\v4.0_4.0.0.0__b77a5c561934e089\System.Runtime.Serialization.dll" /R:"C:\WINDOWS\Microsoft.Net\assembly\GAC_MSIL\System.Web.ApplicationServices\v4.0_4.0.0.0__31bf3856ad364e35\System.Web.ApplicationServices.dll" /R:"C:\WINDOWS\Microsoft.NET\Framework\v4.0.30319\Temporary ASP.NET Files\root\b6f933fb\d485e5f6\assembly\dl3\2a58aac6\0081dfbf_2824cd01\Interop.BCACOMLib.dll" /R:"C:\WINDOWS\Microsoft.NET\Framework\v4.0.30319\Temporary ASP.NET Files\root\b6f933fb\d485e5f6\assembly\dl3\e7c789aa\e427dae1_0388cd01\cnBaiYun.Model.dll" /R:"C:\WINDOWS\Microsoft.Net\assembly\GAC_MSIL\System.ServiceModel\v4.0_4.0.0.0__b77a5c561934e089\System.ServiceModel.dll" /R:"C:\WINDOWS\Microsoft.Net\assembly\GAC_MSIL\Microsoft.CSharp\v4.0_4.0.0.0__b03f5f7f11d50a3a\Microsoft.CSharp.dll" /R:"C:\WINDOWS\Microsoft.NET\Framework\v4.0.30319\Temporary ASP.NET Files\root\b6f933fb\d485e5f6\assembly\dl3\9b34435f\6cf435e6_0388cd01\App_WebReferences.dll" /R:"C:\WINDOWS\Microsoft.Net\assembly\GAC_MSIL\System.Data.Entity.Design\v4.0_4.0.0.0__b77a5c561934e089\System.Data.Entity.Design.dll" /R:"C:\WINDOWS\Microsoft.Net\assembly\GAC_32\System.EnterpriseServices\v4.0_4.0.0.0__b03f5f7f11d50a3a\System.EnterpriseServices.dll" /R:"C:\WINDOWS\Microsoft.Net\assembly\GAC_32\System.Web\v4.0_4.0.0.0__b03f5f7f11d50a3a\System.Web.dll" /R:"C:\WINDOWS\Microsoft.Net\assembly\GAC_MSIL\System.Xml.Linq\v4.0_4.0.0.0__b77a5c561934e089\System.Xml.Linq.dll" /R:"C:\WINDOWS\Microsoft.NET\Framework\v4.0.30319\Temporary ASP.NET Files\root\b6f933fb\d485e5f6\assembly\dl3\81b89984\00fa9d8b_4932cd01\CKFinder.dll" /R:"C:\WINDOWS\Microsoft.Net\assembly\GAC_MSIL\System.ServiceModel.Activities\v4.0_4.0.0.0__31bf3856ad364e35\System.ServiceModel.Activities.dll" /R:"C:\WINDOWS\Microsoft.Net\assembly\GAC_MSIL\System.Xml\v4.0_4.0.0.0__b77a5c561934e089\System.Xml.dll" /R:"C:\WINDOWS\Microsoft.NET\Framework\v4.0.30319\Temporary ASP.NET Files\root\b6f933fb\d485e5f6\assembly\dl3\ce5e485a\0081dfbf_2824cd01\AjaxControlToolkit.dll" /R:"C:\WINDOWS\Microsoft.NET\Framework\v4.0.30319\Temporary ASP.NET Files\root\b6f933fb\d485e5f6\assembly\dl3\57b45f97\006ad756_5274cc01\CKEditor.NET.dll" /R:"C:\WINDOWS\Microsoft.Net\assembly\GAC_MSIL\System.Security\v4.0_4.0.0.0__b03f5f7f11d50a3a\System.Security.dll" /R:"C:\WINDOWS\Microsoft.Net\assembly\GAC_MSIL\System.Web.Services\v4.0_4.0.0.0__b03f5f7f11d50a3a\System.Web.Services.dll" /R:"C:\WINDOWS\Microsoft.NET\Framework\v4.0.30319\mscorlib.dll" /R:"C:\WINDOWS\Microsoft.NET\Framework\v4.0.30319\Temporary ASP.NET Files\root\b6f933fb\d485e5f6\assembly\dl3\05845d27\4e9c00e7_0388cd01\App_Web_dourjpah.dll" /R:"C:\WINDOWS\Microsoft.Net\assembly\GAC_MSIL\System.ComponentModel.DataAnnotations\v4.0_4.0.0.0__31bf3856ad364e35\System.ComponentModel.DataAnnotations.dll" /R:"C:\WINDOWS\Microsoft.Net\assembly\GAC_MSIL\System\v4.0_4.0.0.0__b77a5c561934e089\System.dll" /R:"C:\WINDOWS\Microsoft.Net\assembly\GAC_MSIL\System.Data.Entity\v4.0_4.0.0.0__b77a5c561934e089\System.Data.Entity.dll" /R:"C:\WINDOWS\Microsoft.NET\Framework\v4.0.30319\Temporary ASP.NET Files\root\b6f933fb\d485e5f6\assembly\dl3\cfe2e4cd\90f173e6_0388cd01\App_Code.dll" /R:"C:\WINDOWS\Microsoft.NET\Framework\v4.0.30319\Temporary ASP.NET Files\root\b6f933fb\d485e5f6\assembly\dl3\b9a7bb2f\22f092e6_0388cd01\App_global.asax.dll" /R:"C:\WINDOWS\Microsoft.Net\assembly\GAC_MSIL\System.Web.Extensions\v4.0_4.0.0.0__31bf3856ad364e35\System.Web.Extensions.dll" /R:"C:\WINDOWS\Microsoft.NET\Framework\v4.0.30319\Temporary ASP.NET Files\root\b6f933fb\d485e5f6\assembly\dl3\7bf29c54\0081dfbf_2824cd01\tenpayLib.dll" /R:"C:\WINDOWS\Microsoft.Net\assembly\GAC_MSIL\System.Drawing\v4.0_4.0.0.0__b03f5f7f11d50a3a\System.Drawing.dll" /R:"C:\WINDOWS\Microsoft.Net\assembly\GAC_MSIL\System.IdentityModel\v4.0_4.0.0.0__b77a5c561934e089\System.IdentityModel.dll" /R:"C:\WINDOWS\Microsoft.Net\assembly\GAC_MSIL\System.Data.DataSetExtensions\v4.0_4.0.0.0__b77a5c561934e089\System.Data.DataSetExtensions.dll" /R:"C:\WINDOWS\Microsoft.Net\assembly\GAC_MSIL\System.WorkflowServices\v4.0_4.0.0.0__31bf3856ad364e35\System.WorkflowServices.dll" /R:"C:\WINDOWS\Microsoft.Net\assembly\GAC_MSIL\System.Activities\v4.0_4.0.0.0__31bf3856ad364e35\System.Activities.dll" /R:"C:\WINDOWS\Microsoft.Net\assembly\GAC_32\System.Data\v4.0_4.0.0.0__b77a5c561934e089\System.Data.dll" /R:"C:\WINDOWS\Microsoft.Net\assembly\GAC_MSIL\System.Core\v4.0_4.0.0.0__b77a5c561934e089\System.Core.dll" /R:"C:\WINDOWS\Microsoft.NET\Framework\v4.0.30319\Temporary ASP.NET Files\root\b6f933fb\d485e5f6\assembly\dl3\7f532293\0081dfbf_2824cd01\tenpay.dll" /R:"C:\WINDOWS\Microsoft.Net\assembly\GAC_MSIL\System.Web.DynamicData\v4.0_4.0.0.0__31bf3856ad364e35\System.Web.DynamicData.dll" /R:"C:\WINDOWS\Microsoft.NET\Framework\v4.0.30319\Temporary ASP.NET Files\root\b6f933fb\d485e5f6\assembly\dl3\4dc681be\d2bf53e2_0388cd01\cnBaiYun.DAL.dll" /R:"C:\WINDOWS\Microsoft.Net\assembly\GAC_MSIL\System.Configuration\v4.0_4.0.0.0__b03f5f7f11d50a3a\System.Configuration.dll" /R:"C:\WINDOWS\Microsoft.Net\assembly\GAC_MSIL\System.ServiceModel.Web\v4.0_4.0.0.0__31bf3856ad364e35\System.ServiceModel.Web.dll" /R:"C:\WINDOWS\Microsoft.Net\assembly\GAC_MSIL\System.ServiceModel.Activation\v4.0_4.0.0.0__31bf3856ad364e35\System.ServiceModel.Activation.dll" /R:"C:\WINDOWS\Microsoft.Net\assembly\GAC_MSIL\System.Web.Entity\v4.0_4.0.0.0__b77a5c561934e089\System.Web.Entity.dll" /out:"C:\WINDOWS\Microsoft.NET\Framework\v4.0.30319\Temporary ASP.NET Files\root\b6f933fb\d485e5f6\App_Web_alltop.ascx.cc961b29.y7q_xqyt.dll" /D:DEBUG /debug+ /optimize- /win32res:"C:\WINDOWS\Microsoft.NET\Framework\v4.0.30319\Temporary ASP.NET Files\root\b6f933fb\d485e5f6\nkxhfbzw.res" /w:4 /nowarn:1659;1699;1701 /warnaserror- "C:\WINDOWS\Microsoft.NET\Framework\v4.0.30319\Temporary ASP.NET Files\root\b6f933fb\d485e5f6\App_Web_alltop.ascx.cc961b29.y7q_xqyt.0.cs" "C:\WINDOWS\Microsoft.NET\Framework\v4.0.30319\Temporary ASP.NET Files\root\b6f933fb\d485e5f6\App_Web_alltop.ascx.cc961b29.y7q_xqyt.1.cs"rnrnrnrnfatal error CS0002: Unable to load message string from resources.rnfatal error CS0002: Unable to load message string from resources.rnrn rn 论坛

Compiler Error Message: The compiler failed with error code 128.

08-15

不知道什么时候开始报这个错误,现在已经重装了.NetFrame Work 1.0 +sp2还是报错,问题出在哪呢?rnrnrnServer Error in '/' Application.rn--------------------------------------------------------------------------------rnrnCompilation Error rnDescription: An error occurred during the compilation of a resource required to service this request. Please review the following specific error details and modify your source code appropriately. rnrnCompiler Error Message: The compiler failed with error code 128.rnrnrnrnShow Detailed Compiler Output:rnrnrnC:\WINNT\system32> "c:\winnt\microsoft.net\framework\v1.0.3705\csc.exe" /t:library /utf8output /R:"c:\winnt\assembly\gac\system\1.0.3300.0__b77a5c561934e089\system.dll" /R:"c:\winnt\assembly\gac\system.web\1.0.3300.0__b03f5f7f11d50a3a\system.web.dll" /R:"c:\winnt\microsoft.net\framework\v1.0.3705\mscorlib.dll" /R:"c:\winnt\microsoft.net\framework\v1.0.3705\temporary asp.net files\root\872f2ddf\d6fd8929\assembly\dl2\444e3219\80aba5cf_0683c401\webapplication2.dll" /R:"c:\winnt\assembly\gac\system.xml\1.0.3300.0__b77a5c561934e089\system.xml.dll" /R:"c:\winnt\assembly\gac\system.enterpriseservices\1.0.3300.0__b03f5f7f11d50a3a\system.enterpriseservices.dll" /R:"c:\winnt\assembly\gac\system.drawing\1.0.3300.0__b03f5f7f11d50a3a\system.drawing.dll" /R:"c:\winnt\assembly\gac\system.web.services\1.0.3300.0__b03f5f7f11d50a3a\system.web.services.dll" /R:"c:\winnt\assembly\gac\system.data\1.0.3300.0__b77a5c561934e089\system.data.dll" /out:"C:\WINNT\Microsoft.NET\Framework\v1.0.3705\Temporary ASP.NET Files\root\872f2ddf\d6fd8929\brwra8a8.dll" /D:DEBUG /debug+ /optimize- /warnaserror /w:1 "C:\WINNT\Microsoft.NET\Framework\v1.0.3705\Temporary ASP.NET Files\root\872f2ddf\d6fd8929\brwra8a8.0.cs"rnrnrnrn rnrnrnrnShow Complete Compilation Source:rnrnrnLine 1: //------------------------------------------------------------------------------rnLine 2: // rnLine 3: // This code was generated by a tool.rnLine 4: // Runtime Version: 1.0.3705.288rnLine 5: //rnLine 6: // Changes to this file may cause incorrect behavior and will be lost if rnLine 7: // the code is regenerated.rnLine 8: // rnLine 9: //------------------------------------------------------------------------------rnLine 10: rnLine 11: namespace ASP rnLine 12: using System;rnLine 13: using System.Collections;rnLine 14: using System.Collections.Specialized;rnLine 15: using System.Configuration;rnLine 16: using System.Text;rnLine 17: using System.Text.RegularExpressions;rnLine 18: using System.Web;rnLine 19: using System.Web.Caching;rnLine 20: using System.Web.SessionState;rnLine 21: using System.Web.Security;rnLine 22: using System.Web.UI;rnLine 23: using System.Web.UI.WebControls;rnLine 24: using System.Web.UI.HtmlControls;rnLine 25: rnLine 26: rnLine 27: [System.Runtime.CompilerServices.CompilerGlobalScopeAttribute()]rnLine 28: public class Global_asax : WebApplication2.Global rnLine 29: rnLine 30: private static bool __intialized = false;rnLine 31: rnLine 32: public Global_asax() rnLine 33: if ((ASP.Global_asax.__intialized == false)) rnLine 34: ASP.Global_asax.__intialized = true;rnLine 35: rnLine 36: rnLine 37: rnLine 38: rnLine 39: rn rnrnrnrnrn--------------------------------------------------------------------------------rnVersion Information: Microsoft .NET Framework Version:1.0.3705.288; ASP.NET Version:1.0.3705.288 论坛

征解:Compiler Error Message: The compiler failed with error code 128.

08-15

不知道什么时候开始报这个错误,现在已经重装了.NetFrame Work 1.0 +sp2还是报错,问题出在哪呢?rnrnrnServer Error in '/' Application.rn--------------------------------------------------------------------------------rnrnCompilation Error rnDescription: An error occurred during the compilation of a resource required to service this request. Please review the following specific error details and modify your source code appropriately. rnrnCompiler Error Message: The compiler failed with error code 128.rnrnrnrnShow Detailed Compiler Output:rnrnrnC:\WINNT\system32> "c:\winnt\microsoft.net\framework\v1.0.3705\csc.exe" /t:library /utf8output /R:"c:\winnt\assembly\gac\system\1.0.3300.0__b77a5c561934e089\system.dll" /R:"c:\winnt\assembly\gac\system.web\1.0.3300.0__b03f5f7f11d50a3a\system.web.dll" /R:"c:\winnt\microsoft.net\framework\v1.0.3705\mscorlib.dll" /R:"c:\winnt\microsoft.net\framework\v1.0.3705\temporary asp.net files\root\872f2ddf\d6fd8929\assembly\dl2\444e3219\80aba5cf_0683c401\webapplication2.dll" /R:"c:\winnt\assembly\gac\system.xml\1.0.3300.0__b77a5c561934e089\system.xml.dll" /R:"c:\winnt\assembly\gac\system.enterpriseservices\1.0.3300.0__b03f5f7f11d50a3a\system.enterpriseservices.dll" /R:"c:\winnt\assembly\gac\system.drawing\1.0.3300.0__b03f5f7f11d50a3a\system.drawing.dll" /R:"c:\winnt\assembly\gac\system.web.services\1.0.3300.0__b03f5f7f11d50a3a\system.web.services.dll" /R:"c:\winnt\assembly\gac\system.data\1.0.3300.0__b77a5c561934e089\system.data.dll" /out:"C:\WINNT\Microsoft.NET\Framework\v1.0.3705\Temporary ASP.NET Files\root\872f2ddf\d6fd8929\brwra8a8.dll" /D:DEBUG /debug+ /optimize- /warnaserror /w:1 "C:\WINNT\Microsoft.NET\Framework\v1.0.3705\Temporary ASP.NET Files\root\872f2ddf\d6fd8929\brwra8a8.0.cs"rnrnrnrn rnrnrnrnShow Complete Compilation Source:rnrnrnLine 1: //------------------------------------------------------------------------------rnLine 2: // rnLine 3: // This code was generated by a tool.rnLine 4: // Runtime Version: 1.0.3705.288rnLine 5: //rnLine 6: // Changes to this file may cause incorrect behavior and will be lost if rnLine 7: // the code is regenerated.rnLine 8: // rnLine 9: //------------------------------------------------------------------------------rnLine 10: rnLine 11: namespace ASP rnLine 12: using System;rnLine 13: using System.Collections;rnLine 14: using System.Collections.Specialized;rnLine 15: using System.Configuration;rnLine 16: using System.Text;rnLine 17: using System.Text.RegularExpressions;rnLine 18: using System.Web;rnLine 19: using System.Web.Caching;rnLine 20: using System.Web.SessionState;rnLine 21: using System.Web.Security;rnLine 22: using System.Web.UI;rnLine 23: using System.Web.UI.WebControls;rnLine 24: using System.Web.UI.HtmlControls;rnLine 25: rnLine 26: rnLine 27: [System.Runtime.CompilerServices.CompilerGlobalScopeAttribute()]rnLine 28: public class Global_asax : WebApplication2.Global rnLine 29: rnLine 30: private static bool __intialized = false;rnLine 31: rnLine 32: public Global_asax() rnLine 33: if ((ASP.Global_asax.__intialized == false)) rnLine 34: ASP.Global_asax.__intialized = true;rnLine 35: rnLine 36: rnLine 37: rnLine 38: rnLine 39: rn rnrnrnrnrn--------------------------------------------------------------------------------rnVersion Information: Microsoft .NET Framework Version:1.0.3705.288; ASP.NET Version:1.0.3705.288rn 论坛

yum update failed! help

11-03

I always failed when update using yum: rn rn[root@pv-chem-file yum]# yum -y update rnSetting up Update Process rnSetting up Repos rnbase 100% ¦========================= ¦ 1.1 kB 00:00 rnupdates-released 100% ¦========================= ¦ 951 B 00:00 rnReading repository metadata in from local files rnbase : ################################################## 2622/2622 rnupdates-re: ################################################## 944/944 rnResolving Dependencies rn--> Populating transaction set with selected packages. Please wait. rn---> Downloading header for kernel-smp to pack into transaction set. rnkernel-smp-2.6.12-1.1381_ 100% ¦========================= ¦ 860 kB 00:00 rn---> Package kernel-smp.i686 0:2.6.12-1.1381_FC3 set to be installed rn--> Running transaction check rn rnDependencies Resolved rnTransaction Listing: rnInstall: kernel-smp.i686 0:2.6.12-1.1381_FC3 - updates-released rnTotal download size: 17 M rnDownloading Packages: rn(1/1): kernel-smp-2.6.12- 100% ¦========================= ¦ 17 MB 00:03 rnRunning Transaction Test rnFinished Transaction Test rnTransaction Check Error: installing package kernel-smp-2.6.12-1.1381_FC3 rnneeds 19MB on the / filesystem rn rnI was told that the reason is I don't have enough space on / filesystem (they need 19M), but using "df" command, I found I still have 50M space on / filesystem. rn rn[root@pv-chem-file yum]# df rnFilesystem 1K-blocks Used Available Use% Mounted on rn/dev/sda1 505604 429100 50400 90% / rn/dev/sda5 63384708 13490808 46674076 23% /home/pv-chem-file rnnone 517280 0 517280 0% /dev/shm rn/dev/sda2 5036316 1329044 3451440 28% /usr rn128.250.110.160:/home/webserver rn7352928 5752640 1226784 83% /home/webserver rn rnWho can tell me why? rn 论坛

Android Studio Cmake时链接出现错误 Error:error: linker command failed with exit code 1

10-18

Execution failed for task ':mylibrary:externalNativeBuildDebug'.rn> Build command failed.rn Error while executing process C:\Users\HC\AppData\Local\Android\Sdk\cmake\3.6.4111459\bin\cmake.exe with arguments --build E:\RSDownload_W\ArrDemo2\mylibrary\.externalNativeBuild\cmake\debug\arm64-v8a --target mylibraryrn [1/2] Building CXX object CMakeFiles/mylibrary.dir/src/main/jni/XJni.cpp.orn [2/2] Linking CXX shared library ..\..\..\..\build\intermediates\cmake\debug\obj\arm64-v8a\libmylibrary.sorn FAILED: cmd.exe /C "cd . && C:\Users\HC\AppData\Local\Android\Sdk\android-ndk-r14b\toolchains\llvm\prebuilt\windows-x86_64\bin\clang++.exe --target=aarch64-none-linux-android --gcc-toolchain=C:/Users/HC/AppData/Local/Android/Sdk/android-ndk-r14b/toolchains/aarch64-linux-android-4.9/prebuilt/windows-x86_64 --sysroot=C:/Users/HC/AppData/Local/Android/Sdk/android-ndk-r14b/platforms/android-21/arch-arm64 -fPIC -g -DANDROID -ffunction-sections -funwind-tables -fstack-protector-strong -no-canonical-prefixes -Wa,--noexecstack -Wformat -Werror=format-security -g -DANDROID -ffunction-sections -funwind-tables -fstack-protector-strong -no-canonical-prefixes -Wa,--noexecstack -Wformat -Werror=format-security -O0 -fno-limit-debug-info -O0 -fno-limit-debug-info -Wl,--build-id -Wl,--warn-shared-textrel -Wl,--fatal-warnings -Wl,--no-undefined -Wl,-z,noexecstack -Qunused-arguments -Wl,-z,relro -Wl,-z,now -Wl,--build-id -Wl,--warn-shared-textrel -Wl,--fatal-warnings -Wl,--no-undefined -Wl,-z,noexecstack -Qunused-arguments -Wl,-z,relro -Wl,-z,now -shared -Wl,-soname,libmylibrary.so -o ..\..\..\..\build\intermediates\cmake\debug\obj\arm64-v8a\libmylibrary.so CMakeFiles/mylibrary.dir/src/main/jni/XJni.cpp.o -llog -llog -lutil -linertial -losal -lprotocals -lm "C:/Users/HC/AppData/Local/Android/Sdk/android-ndk-r14b/sources/cxx-stl/gnu-libstdc++/4.9/libs/arm64-v8a/libgnustl_static.a" && cd ."rn C:/Users/HC/AppData/Local/Android/Sdk/android-ndk-r14b/toolchains/aarch64-linux-android-4.9/prebuilt/windows-x86_64/lib/gcc/aarch64-linux-android/4.9.x/../../../../aarch64-linux-android/bin\ld: cannot find -lutilrn C:/Users/HC/AppData/Local/Android/Sdk/android-ndk-r14b/toolchains/aarch64-linux-android-4.9/prebuilt/windows-x86_64/lib/gcc/aarch64-linux-android/4.9.x/../../../../aarch64-linux-android/bin\ld: cannot find -linertialrn C:/Users/HC/AppData/Local/Android/Sdk/android-ndk-r14b/toolchains/aarch64-linux-android-4.9/prebuilt/windows-x86_64/lib/gcc/aarch64-linux-android/4.9.x/../../../../aarch64-linux-android/bin\ld: cannot find -losalrn C:/Users/HC/AppData/Local/Android/Sdk/android-ndk-r14b/toolchains/aarch64-linux-android-4.9/prebuilt/windows-x86_64/lib/gcc/aarch64-linux-android/4.9.x/../../../../aarch64-linux-android/bin\ld: cannot find -lprotocalsrn clang++.exe: error: linker command failed with exit code 1 (use -v to see invocation)rn ninja: build stopped: subcommand failed.rn 论坛

SSIS Error Code DTS_E_PRIMEOUTPUTFAILED. error code 0xC0202009

03-19

MessagernStarted: 1:06:23 AM Error: 2013-03-19 01:45:32.84 Code: 0xC002F304 Source: Send Mail Of SCTM Sync failure Send Mail Task Description: An error occurred with the following error message: "The specified string is not in the form required for a subject.". End Error rnrnError: 2013-03-19 01:45:32.86 Code: 0xC0202009 Source: Copy Test Cases To Local OLE DB Source [1] Description: SSIS Error Code DTS_E_OLEDBERROR. An OLE DB error has occurred. Error code: 0x80004005. An OLE DB record is available. Source: "Microsoft SQL Server Native Client 10.0" Hresult: 0x80004005 Description: "Transaction (Process ID 79) was deadlocked on lock resources with another process and has been chosen as the deadlock victim. Rerun the transaction.". End Error rnrnError: 2013-03-19 01:45:32.89 Code: 0xC0047038 Source: Copy Test Cases To Local SSIS.Pipeline Description: [color=#FF0000]SSIS Error Code DTS_E_PRIMEOUTPUTFAILED.[/color] The PrimeOutput method on component "OLE DB Source" (1) returned error code 0xC0202009. The component returned a failure code when the pipeline engine called PrimeOutput(). The meaning of the failure code is defined by the component, but the error is fatal and the pipeline stopped executing. There may be error messages posted before this with more information about the failure. End Error DTExec: The package execution returned DTSER_FAILURE (1). rnrnStarted: 1:06:23 AM Finished: 1:45:41 AM Elapsed: 2357.61 seconds. The package execution failed. The step failed.rnrn偶尔会出现这个错误,不知道为什么? 论坛

org.springframework.boot.SpringApplication - Error handling failed

04-20

2018-04-20 13:17:04.603 [main] DEBUG org.springframework.beans.factory.support.DrnefaultListableBeanFactory - Creating shared instance of singleton bean 'org.sprirnngframework.transaction.annotation.ProxyTransactionManagementConfiguration'rn2018-04-20 13:17:04.603 [main] DEBUG org.springframework.beans.factory.support.DrnefaultListableBeanFactory - Creating instance of bean 'org.springframework.transrnaction.annotation.ProxyTransactionManagementConfiguration'rn2018-04-20 13:17:04.603 [main] DEBUG org.springframework.beans.factory.support.DrnefaultListableBeanFactory - Eagerly caching bean 'org.springframework.transactiornn.annotation.ProxyTransactionManagementConfiguration' to allow for resolving potrnential circular referencesrn2018-04-20 13:17:04.603 [main] DEBUG org.springframework.beans.factory.annotatiornn.InjectionMetadata - Processing injected element of bean 'org.springframework.trnransaction.annotation.ProxyTransactionManagementConfiguration': AutowiredMethodErnlement for void org.springframework.transaction.annotation.AbstractTransactionMarnnagementConfiguration.setConfigurers(java.util.Collection)rn2018-04-20 13:17:04.618 [main] ERROR org.springframework.boot.SpringApplicationrn- Error handling failedrnorg.springframework.beans.factory.BeanCreationException: Error creating bean witrnh name 'sqlSessionFactory-yxd' defined in class path resource [config/spring-mybrnatis.xml]: Cannot resolve reference to bean 'datasource-yxd' while setting beanrnproperty 'dataSource'; nested exception is org.springframework.beans.factory.BearnnCreationException: Error creating bean with name 'datasource-yxd' defined in clrnass path resource [config/spring-mybatis.xml]: Initialization of bean failed; nernsted exception is org.springframework.beans.factory.BeanCreationException: Errorrn creating bean with name 'org.springframework.transaction.annotation.ProxyTransarnctionManagementConfiguration': Initialization of bean failed; nested exception irns org.springframework.beans.factory.NoSuchBeanDefinitionException: No bean namedrn 'org.springframework.context.annotation.ConfigurationClassPostProcessor.importRrnegistry' is definedrn at org.springframework.beans.factory.support.BeanDefinitionValueResolverrn.resolveReference(BeanDefinitionValueResolver.java:359)rn at org.springframework.beans.factory.support.BeanDefinitionValueResolverrn.resolveValueIfNecessary(BeanDefinitionValueResolver.java:108)rn at org.springframework.beans.factory.support.AbstractAutowireCapableBeanrnFactory.applyPropertyValues(AbstractAutowireCapableBeanFactory.java:1481)rn at org.springframework.beans.factory.support.AbstractAutowireCapableBeanrnFactory.populateBean(AbstractAutowireCapableBeanFactory.java:1226)rn at org.springframework.beans.factory.support.AbstractAutowireCapableBeanrnFactory.doCreateBean(AbstractAutowireCapableBeanFactory.java:543)rn at org.springframework.beans.factory.support.AbstractAutowireCapableBeanrnFactory.createBean(AbstractAutowireCapableBeanFactory.java:482) 论坛

ERROR - Context initialization failed

01-06

以下是我配置applicationContext.xml文件,启动服务时出现以下错误,请高手指教:rnERROR - Context initialization failedrnorg.springframework.beans.factory.BeanCreationException: Error creating bean with name 'dataSources' defined in ServletContext resource [/WEB-INF/classes/applicationContext.xml]: Error setting property values; nested exception is org.springframework.beans.PropertyBatchUpdateException; nested PropertyAccessExceptions (1) are:rnPropertyAccessException 1: org.springframework.beans.MethodInvocationException: Property 'driverClassName' threw exception; nested exception is org.springframework.jdbc.CannotGetJdbcConnectionException: Could not load JDBC driver class [com.microsoft.sqlserver.jdbc.SQLServerDriver]; nested exception is java.lang.ClassNotFoundException: com.microsoft.sqlserver.jdbc.SQLServerDriverrnCaused by: rnorg.springframework.beans.PropertyBatchUpdateException; nested PropertyAccessException details (1) are:rnPropertyAccessException 1:rnorg.springframework.beans.MethodInvocationException: Property 'driverClassName' threw exception; nested exception is org.springframework.jdbc.CannotGetJdbcConnectionException: Could not load JDBC driver class [com.microsoft.sqlserver.jdbc.SQLServerDriver]; nested exception is java.lang.ClassNotFoundException: com.microsoft.sqlserver.jdbc.SQLServerDriverrnCaused by: rnorg.springframework.jdbc.CannotGetJdbcConnectionException: Could not load JDBC driver class [com.microsoft.sqlserver.jdbc.SQLServerDriver]; nested exception is java.lang.ClassNotFoundException: com.microsoft.sqlserver.jdbc.SQLServerDriverrnCaused by: rnjava.lang.ClassNotFoundException: com.microsoft.sqlserver.jdbc.SQLServerDriverrn at org.apache.catalina.loader.WebappClassLoader.loadClass(WebappClassLoader.java:1438)rn at org.apache.catalina.loader.WebappClassLoader.loadClass(WebappClassLoader.java:1284)rn at java.lang.ClassLoader.loadClassInternal(ClassLoader.java:320)rn at java.lang.Class.forName0(Native Method)rn at java.lang.Class.forName(Class.java:247)rn at org.springframework.jdbc.datasource.DriverManagerDataSource.setDriverClassName(DriverManagerDataSource.java:146)rn at sun.reflect.NativeMethodAccessorImpl.invoke0(Native Method)rn at sun.reflect.NativeMethodAccessorImpl.invoke(NativeMethodAccessorImpl.java:39)rn at sun.reflect.DelegatingMethodAccessorImpl.invoke(DelegatingMethodAccessorImpl.java:25)rn at java.lang.reflect.Method.invoke(Method.java:597)rn at org.springframework.beans.BeanWrapperImpl.setPropertyValue(BeanWrapperImpl.java:821)rn at org.springframework.beans.BeanWrapperImpl.setPropertyValue(BeanWrapperImpl.java:645)rn at org.springframework.beans.AbstractPropertyAccessor.setPropertyValues(AbstractPropertyAccessor.java:78)rn at org.springframework.beans.AbstractPropertyAccessor.setPropertyValues(AbstractPropertyAccessor.java:59)rn at org.springframework.beans.factory.support.AbstractAutowireCapableBeanFactory.applyPropertyValues(AbstractAutowireCapableBeanFactory.java:1122)rn at org.springframework.beans.factory.support.AbstractAutowireCapableBeanFactory.populateBean(AbstractAutowireCapableBeanFactory.java:857)rn at org.springframework.beans.factory.support.AbstractAutowireCapableBeanFactory.createBean(AbstractAutowireCapableBeanFactory.java:423)rn at org.springframework.beans.factory.support.AbstractBeanFactory$1.getObject(AbstractBeanFactory.java:249)rn at org.springframework.beans.factory.support.DefaultSingletonBeanRegistry.getSingleton(DefaultSingletonBeanRegistry.java:155)rn at org.springframework.beans.factory.support.AbstractBeanFactory.getBean(AbstractBeanFactory.java:246)rn at org.springframework.beans.factory.support.AbstractBeanFactory.getBean(AbstractBeanFactory.java:160)rn at org.springframework.beans.factory.support.DefaultListableBeanFactory.preInstantiateSingletons(DefaultListableBeanFactory.java:291)rn at org.springframework.context.support.AbstractApplicationContext.refresh(AbstractApplicationContext.java:352)rn at org.springframework.web.struts.ContextLoaderPlugIn.createWebApplicationContext(ContextLoaderPlugIn.java:354)rn at org.springframework.web.struts.ContextLoaderPlugIn.initWebApplicationContext(ContextLoaderPlugIn.java:295)rn 论坛

没有更多推荐了,返回首页