"error while loading shared libraries: xxx.so.x" 错误的原因和解决办法

原创 2012年03月23日 20:28:34

一般我们在Linux下执行某些外部程序的时候可能会提示找不到共享库的错误, 比如:


tmux: error while loading shared libraries: libevent-1.4.so.2: cannot open shared object file: No such file or directory


原因一般有两个, 一个是操作系统里确实没有包含该共享库(lib*.so.*文件)或者共享库版本不对, 遇到这种情况那就去网上下载并安装上即可.

另外一个原因就是已经安装了该共享库, 但执行需要调用该共享库的程序的时候, 程序按照默认共享库路径找不到该共享库文件.

所以安装共享库后要注意共享库路径设置问题, 如下:

1) 如果共享库文件安装到了/lib或/usr/lib目录下, 那么需执行一下ldconfig命令

ldconfig命令的用途, 主要是在默认搜寻目录(/lib和/usr/lib)以及动态库配置文件/etc/ld.so.conf内所列的目录下, 搜索出可共享的动态链接库(格式如lib*.so*), 进而创建出动态装入程序(ld.so)所需的连接和缓存文件. 缓存文件默认为/etc/ld.so.cache, 此文件保存已排好序的动态链接库名字列表.

2) 如果共享库文件安装到了/usr/local/lib(很多开源的共享库都会安装到该目录下)或其它"非/lib或/usr/lib"目录下, 那么在执行ldconfig命令前, 还要把新共享库目录加入到共享库配置文件/etc/ld.so.conf中, 如下:

# cat /etc/ld.so.conf
include ld.so.conf.d/*.conf
# echo "/usr/local/lib" >> /etc/ld.so.conf
# ldconfig

3) 如果共享库文件安装到了其它"非/lib或/usr/lib" 目录下,  但是又不想在/etc/ld.so.conf中加路径(或者是没有权限加路径). 那可以export一个全局变量LD_LIBRARY_PATH, 然后运行程序的时候就会去这个目录中找共享库.

LD_LIBRARY_PATH的意思是告诉loader在哪些目录中可以找到共享库. 可以设置多个搜索目录, 这些目录之间用冒号分隔开. 比如安装了一个mysql到/usr/local/mysql目录下, 其中有一大堆库文件在/usr/local/mysql/lib下面, 则可以在.bashrc或.bash_profile或shell里加入以下语句即可:

export LD_LIBRARY_PATH=/usr/local/mysql/lib:$LD_LIBRARY_PATH   


一般来讲这只是一种临时的解决方案, 在没有权限或临时需要的时候使用.

--End--
版权声明:本文为博主原创文章,未经博主允许不得转载。

相关文章推荐

Makefile执行过程中出错:make: *** No rule to make target ` ‘, needed by xxx. Stop.

【问题】 有个已有的Makefile,执行过程中出错: CLi@PC-CLI-1 ~/develop/docbook/books/python_topic_str_encoding...

make: *** No rule to make target解决办法

今天在公司编译cocos2.2.6源码时出现这个错误:make: * No rule to make target /home/hxl/bin/cocos2d-x-2.2.6/projects/Hel...

make: *** No rule to make target 错误原因、分析和解决办法

很有帮助,已解决问题。具体解决步骤是:   比如我的报错是: make[1]: *** No rule to make target `jni/..//submodules/linphone/oR...

error while loading shared libraries的解决方法

和本菜鸟一样Linux的初学者在运行一些开源项目的时候,常常会出现如下错误: ./tests: error while loading shared libraries: xxx.so.0:...

error while loading shared libraries 错误解决办法总结,

最近安装了装了几次ACE库,装起来会出现很多问题。 其实我发现直接按照ace的帮助文档进行编写。就差不多。 安装完成后,经常会遇到以下问题error while loading shared lib...

linux添加库后出现 error while loading shared libraries: libjson.so

在linux下运行程序时,发现了error while loading shared libraries这种错误,一时间不知道解决办法,在网上搜索,终于解决了:   ./tests: er...

Linux下Qt程序的打包发布

程序以test为例: 1. QtCreate使用Release版本编译 2. 从可运行程序的文件中拿出可执行文件,例:test 3. 终端下使用ldd命令查看需要的连接库,例:l...

error while loading shared libraries的解決方法

在linux下运行程序时,发现了error while loading shared libraries这种错误,一时间不知道解决办法,在网上搜索,终于解决了: ./tests: error whil...

执行srvctl报错 :error while loading shared libraries: libpthread.so.0:

执行srvctl是报错 error while loading shared libraries: libpthread.so.0: [oracle@rac02 ~]$ srvctl /...

Nginx启动错误:error while loading shared libraries: libpcre.so.1

1 # /usr/local/nginx/sbin/nginx 2 /usr/local/nginx/sbin/nginx: error while loading sha...
内容举报
返回顶部
收藏助手
不良信息举报
您举报文章:深度学习:神经网络中的前向传播和反向传播算法推导
举报原因:
原因补充:

(最多只允许输入30个字)