BCB6安装组件包时,报告Linker Error

原创 2005年03月03日 09:54:00

前几天, 在C++Builder6.0安装组件包(内有Delphi单元文件)时, 报告Linker Error: 具体信息如下:

[Linker Error] Unresolved external '__fastcall Outline::TCustomOutline::~TCustomOutline()' referenced from...

后来到网上搜索, 终于找到了解决办法:

在组件包中(Requires部分)加入 bcbsmp.bpi 即可.

路径: $(BCB)/Lib/bcbsmp.bpi

CBC6报错 [Linker Fatal Error]Fatal:Expected a file name:

新建一个文件,直接运行,没有问题; 点击 保存所有,再次运行,会报错:  [Linker Fatal Error]Fatal:Expected a file name:  1、解决办法: 原因:在第一...

C++ builder 之错误总结:安装第三方控件后,编译报错“Linker Fatal Error Unable To Open File”

今天将一个别人的项目程序拿过来研究。项目采用

BCB设计时组件编译错误

如今谁用BCB做可视化组件设计简直就被人笑掉大牙,可惜多年前一个项目需要升级到Rad Studio XE,里面有部分组件用BCB做的,组件本身比较简单,但编译出错,提示propsys.h中的 IPro...
  • aniven
  • aniven
  • 2012年05月17日 10:18
  • 1531

安装两个BCB6控件SynEdit、mwEdit 0.92a的过程总结

fm: http://www.daxia.com/bibis/moredata30_1440875_18030.shtml 我的操作步骤: (1).首先在网络上下载mvEdit 0.92a(mwE...

Install error "Exit Code: 6" or "Exit Code: 7" | Creative Adobe Production(安装Adobe产品时出错及解决方案)

安装Adobe 产品时出现以下提示错误: Exit Code: 7-------------------------------------- Summary --------------------...

Dev C++中的错误的解决[Linker error] undefined reference to `__cpu_features_init' -chu

原文链接:http://hi.baidu.com/dannie007zxl/item/75c4f728ac448381af48f53d   解决NOIP环境GUIDE和Dev之间的并存问题。 装...

错误: error linker command failed with exit code 1 (use –v to see invocation)

error linker command failed with exit code 1 (use –v to see invocation) , error linker 错误汇总...

coco2dx新建项目报错,ld: -pie can only be used when targeting iOS 4.2 or later clang: error: linker command

在新建cocos2d-x以后,运行发现以下错误: ld: -pie can only be used when targeting iOS 4.2 or later clang: error: l...
内容举报
返回顶部
收藏助手
不良信息举报
您举报文章:BCB6安装组件包时,报告Linker Error
举报原因:
原因补充:

(最多只允许输入30个字)