自定义博客皮肤VIP专享

*博客头图:

格式为PNG、JPG,宽度*高度大于1920*100像素,不超过2MB,主视觉建议放在右侧,请参照线上博客头图

请上传大于1920*100像素的图片!

博客底图:

图片格式为PNG、JPG,不超过1MB,可上下左右平铺至整个背景

栏目图:

图片格式为PNG、JPG,图片宽度*高度为300*38像素,不超过0.5MB

主标题颜色:

RGB颜色,例如:#AFAFAF

Hover:

RGB颜色,例如:#AFAFAF

副标题颜色:

RGB颜色,例如:#AFAFAF

自定义博客皮肤

-+

qq_42025798的博客

记录成长,记录学习!

  • 博客(112)
  • 资源 (61)
  • 收藏
  • 关注

原创 Failed to execute goal org.springframework.boot:spring-boot-maven-plugin:2.1.6.RELEASE:repackage (re

Failed to execute goal org.springframework.boot:spring-boot-maven-plugin:2.1.6.RELEASE:repackage (repackage) on project CSDN: Execution repackage of goal org.springframework.boot:spring-boot-maven-plugin:2.1.6.RELEASE:repackage failed: Unable to rename 'xx

2021-04-18 20:05:30 41

原创 黑马企业权限管理系统--jsp+ssm+oracle

黑马企业权限管理系统--ssm+oracle

2021-04-13 00:08:39 1683

原创 VM虚拟机下基于----NAT模式----配置CentOS 7的静态ip

VM虚拟机下基于----NAT模式----配置CentOS 7的静态ip

2021-03-30 17:28:15 33 1

转载 CentOS 7安装Mysql5.7数据库--yum方式(详细安装)

步骤一:删除之前的mysql残留如果你之前有安装过mysql请先阅读一下这篇文章: 卸载清理如果是第一次安装mysql请从步骤二开始阅读步骤二:升级一下系统版本和内核版本因为的的CentOS从官网下载的,可能比较老,安装其他软件的时候总是出现一些奇怪的问题,所以推荐升级。执行命令yum -y update稍微等待一下就好步骤三:下载并安装MySQL官方的 Yum Repositorywget -i -c http://dev.mysql.com/get/mysql57-community

2021-02-28 16:48:28 4104

原创 错误:依赖检测失败: mysql-community-libs(x86-64) >= 5.7.9 被 (已安裝) mysql-community-libs-compat-5.7.33-1.el7.x

错误:依赖检测失败: mysql-community-libs(x86-64) >= 5.7.9 被 (已安裝) mysql-community-libs-compat-5.7.33-1.el7.x86_64 需要

2021-02-28 00:14:57 5725 5

原创 Cause: java.sql.SQLSyntaxErrorException: Unknown column ‘name‘ in ‘field

### Cause: java.sql.SQLSyntaxErrorException: Unknown column 'name' in 'field list'; bad SQL grammar []; nested exception is java.sql.SQLSyntaxErrorException: Unknown column 'name' in 'field list'

2021-02-21 22:12:53 5236

原创 Error creating bean with name ‘txAdvice‘: Cannot resolve reference to bean ‘transactionManager‘ whil

Error creating bean with name 'txAdvice': Cannot resolve reference to bean 'transactionManager' while setting bean property 'transactionManager'; nested exception is org.springframework.beans.factory.NoSuchBeanDefinitionException: No bean named 'transactio

2021-02-21 21:56:02 4665 3

原创 java: 错误: 无效的源发行版:15

产生原因因为我之前用的是jdk15版本,用了发现有很多坑,现在改为1.8版本,打开原理的工程就出现了问题问题描述解决办法把工程中所有的jdk版本都修改成1.8版本即可需要修改三个地方已经截图在下面修改前:修改后:以上三个地方修改完成,项目正常启动!...

2021-02-21 14:04:44 5272

原创 VMware详细安装CentOS 7

第一步:打开Vm创建创建新的虚拟机第二步:选择安装类型的配置这里我选择自定义安装,点击下一步第三步:选择虚拟机硬件兼容性这里我用的是16版本的vm,默认选择就好,下一步第四步:安装操作系统选择稍后安装操作系统,下一步第五步:选择安装的操作系统版本我的是centeros7 64位的系统镜像,这里就选择Centeros7 64位第六步:为虚拟机命名和选择安装目录名字可以任意命名,这里我选择默认名字,修改其安装位置,然后下一步第七步:为虚拟机分配处理器和内核数量这里根据自己主机

2021-02-20 20:17:47 4722 1

原创 程序包javax.servlet.http不存在

程序包javax.servlet.http不存在

2021-02-19 13:49:09 4705

原创 *** FATAL CONFIG FILE ERROR *** Reading the configuration file, at line 341 >>> ‘set-proc-title yes‘

*** FATAL CONFIG FILE ERROR ***Reading the configuration file, at line 341>>> 'set-proc-title yes'Bad directive or wrong number of arguments

2021-05-11 00:10:51 7

原创 nginx 实现反向代理

需求访问 默认端口80,跳转到tomcat 的 首页(8080端口)安装nginx和tomcat安装nginx传送门安装tomcat传送门步骤一:启动tomcat来到tomcat的 安装目录下的bin目录下启动cd /home/wrz/apache-tomcat-9.0.45/bin./startup.sh步骤二:启动nginx来到nginx 的安装目录下启动cd /usr/local/nginx/sbin/./nginx步骤三:修改nginx 配置文件进入n

2021-05-10 23:30:46 26 2

原创 Linux 下安装nginx

步骤一:下载nginx传送门步骤二:安装环境依赖yum -y install gcc openssl openssl-devel pcre-devel zlib zlib-devel步骤三:解压nginx通过可视化工具将nginx上传到linux 服务器上tar -xvzf nginx-1.20.0.tar.gz步骤四:配置nginx进入nginx 目录cd nginx-1.20.0/配置nginx./configure步骤五:编译nginxmake

2021-05-10 23:29:56 23 1

原创 Linux 下删除nginx

步骤一:停止nginx停止nginx./nginx -s stop查看 进程ps -ef | grep nginx步骤二:查看nginx安装目录whereis nginx步骤三:全局查找nginx相关的文件find / -name nginx*步骤四:删除相关文件rm -rf file /usr/local/nginx*步骤五:使用yum卸载 nginx及相关依赖yum remove nginx...

2021-05-10 23:29:29 7

原创 linux 下安装 tomcat 服务器

步骤一:下载tomcat传送门步骤二:上传tomcat到linux步骤三:解压并启动tomcat解压tar -xvzf apache-tomcat-9.0.45.tar.gz进入bin 目录apache-tomcat-9.0.45/bin启动tomcat./startup.shps -ef | grep tomcat

2021-05-10 23:28:40 9

转载 Git: husky > pre-commit (node v14.16.1)

错误产生环境使用vscode 往码云提交代码时产生错误描述Git: husky > pre-commit (node v14.16.1)错误原因在将代码提交到本地仓库的时候:git commit提交时报错Stashing changes…[started]项目中使用了husky, 这个会在你git commit的时候先执行里面的严谨模式, 对代码进行检查, 有error就会终止提交git commit前检测husky与pre-commit解决办法使用以下命令提交 gi

2021-05-10 20:11:19 21

原创 make: *** 没有规则可以创建“default”需要的目标“build”。 停止。

make: *** 没有规则可以创建“default”需要的目标“build”。 停止。

2021-05-08 22:45:08 9

原创 Window下安装zookeeper,启动时闪退

错误产生环境windows 10系统下 启动zookeeper 服务时闪退错误描述直接闪退,截不了图错误原因没有zoo.cfg配置文件解决办法将conf文件夹下面的zoo_sample.cfg复制一份改名为zoo.cfg再次启动在cmd 命令窗口输入netstat -ano发现2181端口已经占用了,说明zookeeper启动成功了...

2021-05-07 21:52:44 10

原创 Unable to infer base url. This is common when using dynamic servlet registration or when the API is

Unable to infer base url. This is common when using dynamic servlet registration or when the API is behind an API Gateway. The base url is the root of where all the swagger resources are served. For e.g. if the api is available at http://example.org/api/v2

2021-05-06 00:05:17 33

原创 Caused by: com.mysql.cj.exceptions.InvalidConnectionAttributeException: The server time zone value ‘

Caused by: com.mysql.cj.exceptions.InvalidConnectionAttributeException: The server time zone value '�й���׼ʱ��' is unrecognized or represents more than one time zone. You must configure either the server or JDBC driver (via the serverTimezone configuration

2021-05-04 22:46:04 13

原创 SpringBoot 整合thymeleaf--跳转首页

SpringBoot 整合thymeleaf--跳转首页

2021-05-04 22:41:01 11

原创 2021-05-04 16:37:16.550 ERROR 3268 --- [nio-8080-exec-3] o.a.c.c.C.[.[.[/].[dispatcherServlet] :

2021-05-04 16:37:16.550 ERROR 3268 --- [nio-8080-exec-3] o.a.c.c.C.[.[.[/].[dispatcherServlet] : Servlet.service() for servlet [dispatcherServlet] threw exceptionjava.lang.StackOverflowError: null

2021-05-04 22:05:06 176 1

原创 使用SpringBoot自定义国际化时-出现的小问题

错误产生环境SpringBoot项目 自定义国际化时产生(前台thymeleaf模板引擎)错误描述java.lang.ArrayIndexOutOfBoundsException: 1 at cn.bloghut.config.MyLocalResolver.resolveLocale(MyLocalResolver.java:33) 错误原因前台点击语言(中文),发生请求从代码中看到,我前台的中文请求通过get 方式在url 地址后面携带参数 ,在拼接zh_CN 的时候太马虎 使用"

2021-05-04 21:56:55 18

原创 java.sql.SQLNonTransientConnectionException: Cannot load connection class because of underlying exce

java.sql.SQLNonTransientConnectionException: Cannot load connection class because of underlying exception: com.mysql.cj.exceptions.WrongArgumentException: Malformed database URL, failed to parse the main URL sections.Caused by: com.mysql.cj.exceptions.Una

2021-05-02 23:47:02 24

转载 Server returns invalid timezone. Go to ‘Advanced‘ tab and set ‘serverTimezone‘ property manually.

Server returns invalid timezone. Go to 'Advanced' tab and set 'serverTimezone' property manually.

2021-05-02 22:26:20 23

原创 javax.servlet.ServletException: Circular view path [index]: would dispatch back to the current handl

javax.servlet.ServletException: Circular view path [index]: would dispatch back to the current handler URL [/index] again. Check your ViewResolver setup! (Hint: This may be the result of an unspecified view, due to default view name generation.) at org.sp

2021-05-02 20:57:10 30

原创 Access to XMLHttpRequest at ‘http://localhost:8081/demo/test‘ from origin ‘null‘ has been blocked by

Access to XMLHttpRequest at 'http://localhost:8081/demo/test' from origin 'null' has been blocked by CORS policy: No 'Access-Control-Allow-Origin' header is present on the requested resource.localhost:8081/demo/test:1 Failed to load resource: net::ERR_FAIL

2021-05-02 18:41:33 296 1

原创 数据结构与算法--数组结构

自定义数组完成数据的增删改查操作自定义数组类package cn.bloghut.arr2;/** * @Classname MyArr * @Description TODO * @Date 2021/4/30 23:28 * @Created by 闲言 */public class MyArr { private long[] arr; //用于存储数组长度,默认0 private int elements; public MyArr() {

2021-05-01 00:09:02 10

转载 Google Chrome 安装yapi插件cross-request

步骤一:下载cross-request3.1cross-request3.1下载:传送门步骤二:在Google Chrome地址栏输入以下内容chrome://extensions/步骤三:开启开发者模式选择cross-request 文件夹完成

2021-04-27 18:43:52 14

原创 3. 使用Docker 容器搭建YAPI

步骤一:安装docker安装docker步骤二:安装启动 MongoDBdocker run -d --name mongo-yapi mongo查看docker images步骤三:获取 Yapi 镜像docker pull registry.cn-hangzhou.aliyuncs.com/anoy/yapi查看docker images步骤四:初始化 Yapi 数据库索引及管理员账号直接复制粘贴docker run -it --rm \ --link mon

2021-04-26 22:24:04 44

原创 CentOS 7 -安装Docker 容器

步骤一:安装docker执行一下代码,全部复制,一起粘贴即可yum -y install gccyum -y install gcc-c++yum install -y yum-utils device-mapper-persistent-data lvm2yum-config-manager --add-repo http://mirrors.aliyun.com/docker-ce/linux/centos/docker-ce.repoyum makecache fastyum -y i

2021-04-26 21:43:35 36

原创 java.lang.IllegalStateException: zookeeper not connected

java.lang.IllegalStateException: zookeeper not connectedCaused by: java.lang.IllegalStateException: zookeeper not connected at org.apache.dubbo.remoting.zookeeper.curator.CuratorZookeeperClient.<init>(CuratorZookeeperClient.java:80) ~[dubbo-2.7.5.jar:2.7.

2021-04-26 15:02:39 46

原创 java.lang.IllegalStateException: zookeeper not connectedCaused by: java.lang.IllegalStateException:

Caused by: java.lang.IllegalStateException: zookeeper not connected at org.apache.dubbo.remoting.zookeeper.curator.CuratorZookeeperClient.<init>(CuratorZookeeperClient.java:80) ~[dubbo-2.7.5.jar:2.7.5] ... 30 common frames omitted

2021-04-24 20:03:37 43

转载 IDEA创建类模板注释

IDEA创建类模板注释

2021-04-24 14:23:59 8

原创 ‘vue-cli-service‘ 不是内部或外部命令,也不是可运行的程序 或批处理文件。 npm ERR! code ELIFECYCLE npm ERR! errno 1 npm ERR! vue

错误产生环境从githup拉取Element-ui-admin项目,运行npm run dev命令时产生。错误描述'vue-cli-service' 不是内部或外部命令,也不是可运行的程序或批处理文件。npm ERR! code ELIFECYCLEnpm ERR! errno 1npm ERR! vue-element-admin@4.4.0 dev: `vue-cli-service serve`npm ERR! Exit status 1npm ERR!npm ERR! Faile

2021-04-24 11:24:48 31

转载 npm ERR! errno -4048 npm ERR! Error: EPERM: operation not permitted, rename ‘G:\xxx\xxxx\open-his-ui

npm ERR! errno -4048npm ERR! Error: EPERM: operation not permitted, rename 'x:\x\xxx\open-his-ui\node_modules\array-slice\package.json.4086199326' -> 'x:\xx\xxx\open-his-ui\node_modules\array-slice\package.json'npm ERR! [OperationalError: EPERM: op

2021-04-24 11:00:23 23

原创 Error instantiating interface cn.bloghut.dao.UserDao with invalid types () or values (). Cause: java

Error instantiating interface cn.bloghut.dao.UserDao with invalid types () or values (). Cause: java.lang.NoSuchMethodException: cn.bloghut.dao.UserDao.<init>()Caused by: org.apache.ibatis.reflection.ReflectionException: Error instantiating interface cn

2021-04-23 22:37:44 16

原创 Servlet使用 @WebServlet 注解无法访问请求问题

问题产生环境maven + javaweb 工程问题描述请求无法发生到 指定的url 路径问题原因@WebServlet 注解的url 路径填写错误@WebServlet属性详解name :指定Servlet 的 name 属性,等价于 。如果没有显式指定,则该 Servlet 的取值即为类的全限定名。value :该属性等价于 urlPatterns 属性。两个属性不能同时使用。urlPatterns :指定一组 Servlet 的 URL 匹配模式。等价于标签。l

2021-04-21 23:29:41 54 1

转载 Failed to execute goal org.apache.maven.plugins:maven-archetype-plugin:3.2.0:generate (default-cli)

Failed to execute goal org.apache.maven.plugins:maven-archetype-plugin:3.2.0:generate (default-cli) on project standalone-pom: The desired archetype does not exist (org.apache.maven.archetypes:maven-archetype-webapp:RELEASE)

2021-04-21 23:13:37 38

原创 Exception in thread “main“ java.lang.NoClassDefFoundError: org/slf4j/LoggerFactory

错误产生环境从码云下拉取Spring Boot 项目 启动时产生错误描述Exception in thread "main" java.lang.NoClassDefFoundError: org/slf4j/LoggerFactoryCaused by: java.lang.ClassNotFoundException: org.slf4j.LoggerFactory错误原因没有 slf4j 依赖解决办法...

2021-04-19 20:45:49 22

apache-tomcat-9.0.45.zip

apache-tomcat-9.0.45

2021-05-10

nginx-1.18.0windows版.zip

nginx-1.18.0windows版

2021-05-08

jdk-11.0.10_windows-x64_bin.zip

jdk-11.0.10_windows-x64_bin

2021-02-22

windowsdesktop-runtime-5.0.3-win-x86.zip

windowsdesktop-runtime-5.0.3-win-x86

2021-03-04

haxm-windows_v6_0_5.zip

haxm-windows_v6_0_5

2021-03-10

jdk-15.0.2_windows-x64_binexe.zip

jdk-15.0.2_windows-x64_bin.exe

2021-02-22

mongodb-linux-x86_64-rhel70-4.4.4.zip

mongodb-linux-x86_64-rhel70-4.4.4

2021-03-04

mysql-5.6.51-winx64.zip

mysql-5.6.51-winx64

2021-02-28

jdk-15.0.2_linux-x64_bintargz.zip

jdk-15.0.2_linux-x64_bin.tar.gz

2021-02-22

cross-request 31.zip

cross-request3.1.zip

2021-04-27

cross-request.zip

cross-request3.0

2021-04-27

redis-6.2.0.tar.zip

redis-6.2.0.tar

2021-02-24

mysql-8.0.23-winx64-debug-test.zip

mysql-8.0.23-winx64-debug-test

2021-02-22

apache-maven-3.8.1-bin.zip

apache-maven-3.8.1-bin

2021-04-21

mysql-5.7.30-winx64.zip

mysql-5.7.30-winx64

2021-02-28

jdk-15.0.2_windows-x64_bin.zip

jdk-15.0.2_windows-x64_bin

2021-02-22

jdk-11.0.10_linux-x64_bin.tar.zip

jdk-11.0.10_linux-x64_bin.tar

2021-02-22

mysql-8.0.22-winx64.zip

mysql-8.0.22-winx64

2021-02-28

CentOS-7-x86_64-Minimal-1908.zip

CentOS-7-x86_64-Minimal-1908

2021-02-09

node-v14.16.0-x64.zip

node-v14.16.0-x64(window版本)

2021-03-05

mysql-5.6.30-winx64.zip

mysql-5.6.30-winx64

2021-02-28

jdk-8u281-linux-x64.tar.zip

jdk-8u281-linux-x64.tar

2021-02-22

apache-tomcat-9.0.zip

apache-tomcat-9.0

2021-02-09

jurisdiction_paremt.zip

企业权限管理系统源码

2021-04-12

黑马企业权限管理系统sql

数据库表

2021-04-12

Centos7 下安装redis.pdf

Centos7 下安装redis,图文安装步骤详细

2021-03-31

ExperimentOne.zip

安卓代码

2021-03-29

适合新手window7配置java环境变量.docx

适合新手window7配置java环境变量

2021-03-22

msvcr120.zip

msvcr120

2021-03-01

haxm-windows_v7_3_2.zip

haxm-windows_v7_3_2

2021-03-10

Redis-x64-3.2.100.zip

Redis-x64-3.2

2021-02-24

android-18-LINUX.zip

android-18-LINUX

2021-03-10

android-7.zip

android-7安卓SDK7

2021-03-10

android-8.zip

android-8安卓SDK8

2021-03-10

android-17.zip

android-17安卓SDK17

2021-03-10

android-21.zip

android-21安卓SDK21

2021-03-10

windowsdesktop-runtime-5.0.3-win-x64.zip

windowsdesktop-runtime-5.0.3-win-x64

2021-03-04

mysql-5.5.40-win64.zip

mysql-5.5.40-win64

2021-03-08

nginx-1.8.1.tar.zip

nginx-1.8.1.tar

2021-03-08

redis-desktop-manager-0.8.8.384.zip

redis-desktop-manager-0.8.8

2021-03-05

空空如也

空空如也

TA创建的收藏夹 TA关注的收藏夹

TA关注的人 TA的粉丝

提示
确定要删除当前文章?
取消 删除