check_http.c:312: error: ‘ssl_version’

安装nagios-plugins-1.4.16,安装的过程中出现了错误,提示如下、check_http.c:312: error: ‘ssl_version’ undeclared (first use in this function)check_http.c:312:             e rror: (Each undeclared identifier is reported only once

  1. check_http.c:312: error: for each function it appears in.)
    make[2]: *** [check_http.o] Error 1
    make[2]: Leaving directory `/usr/src/nagios-plugins-1.4.16/plugins'
    make[1]: *** [all-recursive] Error 1
    make[1]: Leaving directory `/usr/src/nagios-plugins-1.4.16'
    make: *** [all] Error 2

根据提示觉得是openssl的版本和openssl没有安装的问题,就rpm查看了一下发现已经安装了

  1. 02、 rpm -qa |grep openssl
  2. openssl-0.9.8e-7.el5

想想之前在配置nagios的时候也安装了就去看看关于Openssl的组件少了什么,一查看
多了openssl-devel,然后在EMOS上安装了openssl-devel问题解决。

  1. 03、[root@test ~]# rpm -qa |grep openssl
    openssl-0.9.8e-12.el5_4.6
    openssl-devel-0.9.8e-12.el5_4.6
    openssl-devel-0.9.8e-12.el5_4.6
    openssl-0.9.8e-12.el5_4.6

      

    1. 04、 yum install openssl-devel

转载于:https://www.cnblogs.com/seasonsstory/p/3169838.html

  • 0
    点赞
  • 0
    收藏
    觉得还不错? 一键收藏
  • 0
    评论
评论
添加红包

请填写红包祝福语或标题

红包个数最小为10个

红包金额最低5元

当前余额3.43前往充值 >
需支付:10.00
成就一亿技术人!
领取后你会自动成为博主和红包主的粉丝 规则
hope_wisdom
发出的红包
实付
使用余额支付
点击重新获取
扫码支付
钱包余额 0

抵扣说明:

1.余额是钱包充值的虚拟货币,按照1:1的比例进行支付金额的抵扣。
2.余额无法直接购买下载,可以购买VIP、付费专栏及课程。

余额充值