自定义博客皮肤VIP专享

*博客头图:

格式为PNG、JPG,宽度*高度大于1920*100像素,不超过2MB,主视觉建议放在右侧,请参照线上博客头图

请上传大于1920*100像素的图片!

博客底图:

图片格式为PNG、JPG,不超过1MB,可上下左右平铺至整个背景

栏目图:

图片格式为PNG、JPG,图片宽度*高度为300*38像素,不超过0.5MB

主标题颜色:

RGB颜色,例如:#AFAFAF

Hover:

RGB颜色,例如:#AFAFAF

副标题颜色:

RGB颜色,例如:#AFAFAF

自定义博客皮肤

-+
  • 博客(2133)
  • 资源 (11)
  • 论坛 (2)
  • 收藏
  • 关注

原创 Windows7 64位安装最新版本MySQL服务器

Windows7 64位安装最新版本MySQL服务器 近期,一直在研究MySQL数据库,经常修改配置文件,导致MySQL数据库无法使用,不得不反复重装MySQL数据库。以下是在Windows7 64位操作系统下安装MySQL数据库的详细步骤,以供学习和参考:1、双击点击“mysql-installer-community-5.6.24.0.msi”,进入安装过程...

2015-07-25 00:35:23 6361 20

原创 MySQL出现“错误1067:进程意外终止”

1、错误描述2、错误原因 今天,我在摸索如何利用命令查看MySQL日志,查了很多资料,大多数是通过修改my.ini文件配置。我修改了配置后,准备重启MySQL服务器,先执行了net stop mysql,发现服务还是没停;于是,我直接到Windows7服务下去停止MySQL服务,停了服务后再次重启,就弹出上述警示窗口3、解决办法 为了解决这个问题,...

2015-07-24 23:40:31 3825 5

原创 echarts中的option.legend.data has not been defined.

1、错误描述2、错误原因var map = function(mapData){ require( [ 'echarts', 'echarts/chart/map' ], function (ec) { var mapChart = ec.init(d

2015-07-24 23:33:42 8779 4

原创 Java之JDK环境配置过程(图)

1、在Windows7操作系统下,右键,点击属性,会出现如下界面2、选择“高级系统设置”,如下3、接着点击“环境变量”按钮,会出现如下图:4、找到系统变量,点击“新建”按钮,这时会弹出一个窗口,分别在变量名和变量值框中填入:JAVA_HOME和JDK的路径C:\Program Files\Java\jdk1.7.0_05,点击“确定”;

2013-06-29 00:35:06 4597 7

原创 Java开发工具NetBeans7.3安装过程(附图)

1、双击如图所示的exe文件2、进入安装NetBeans7.3的欢迎界面,进行相应的选择,点击“下一步”3、进入许可协议的阅读,选择“我接受.....”4、进行NetBeans IDE 7.3安装5、GlassFish 4.0 安装6、如果选择了安装Tomcat,则要进行Tomcat的安装,否则就可以跳过这一步7、经过概要,会

2013-06-26 01:03:16 6011 5

原创 CSRF cookie not set

1、错误描述2、错误原因 由于django框架的settings.py配置了中间件,为了防止跨站请求伪造,form表单POST方式会导致出现报错"""Django settings for amnd project.Generated by 'django-admin startproject' using Django 2.2.7.For more information on this file, seehttps://docs.djangoproject.com...

2020-08-11 11:28:44 524

原创 Uncaught SyntaxError: Cannot use import statement outside a module

1、错误描述Uncaught SyntaxError: Cannot use import statement outside a module2、错误原因 定义了一个JavaScript文件,声明几个变量,利用模块化导出变量let name = '张华'let age = 23let sex = '女'export {name, age, sex} 接着,在页面文件中直接导入import;打开浏览器访问页面,控制台出现报错<!DOCTYPE...

2020-08-06 11:41:42 10124 3

原创 Error: Cannot find module ‘@rollup/plugin-replace‘

1、错误描述G:\HBuilderXWork\vue-next>npm run dev> @3.0.0-rc.5 dev G:\HBuilderXWork\vue-next> node scripts/dev.js[!] Error: Cannot find module '@rollup/plugin-replace'Error: Cannot find module '@rollup/plugin-replace' at Function.Module._re

2020-08-04 13:07:23 925

原创 JavaScript全局函数有哪些?

1、decodeURI():解码某个编码的URI2、decodeURIComponent():解码一个编码的URI组件3、encodeURI():把字符串编码为URI4、encodeURIComponent():把字符串编码为URI组件5、escape():对字符串进行编码6、eval():计算 JavaScript 字符串,并把它作为脚本代码来执行7、isFinite():检查某个值是否为有穷大的数8、isNaN():检查某个值是否是数字9、Number():将对象的值转换

2020-07-09 11:29:02 741

原创 如何使用Vue.js和FusionCharts制作2D和3D的柱状图

1、 问题背景 在使用vue.js框架时,可以跟其他的图形插件结合起来,创建不同类型的图形。如果在vue.js项目中安装fusioncharts,然后制作2D和3D的柱状图2、图形组件Column2D3D.vue<template> <div> <el-tabs type="border-card"> <el...

2019-12-29 23:20:33 881

原创 如何在Vue.js和ElementUI框架中获取Collapse组件最后选中的值

1、问题描述 在Vue.js + ElementUI组合框架搭建的项目中,如果要使用Collapse组件,获取对应最后选中项目的值,该如何实现呢?首先,需要判断点击了多个,Collapse组件返回值是什么形式的;然后,根据具体的值,对结果进行处理;最后,获取最后选中的项目值。2、实现源码2.1 组件AccordComponents.vue<templat...

2019-12-20 10:13:20 1482

原创 如何选择一款程序员理想中的显示器

俗话说:工欲善其事必先利其器。对于一名厨师而言,一把锋利的厨刀是做好菜的关键;对于一名战士来说,一竿好枪是保卫祖国和人民的基础;对于程序员来说,有一款理想的显示器,可以提高工作效率,有助于保护眼睛,体验不一样的效果。对于一个人是不是码农,我一般看显示器以及键盘的选择,从这些方面也可以从侧面反映出一个码农的专业素质。 都说我们程序员敲代码是在搬砖,有好【硬】设备的加持才...

2019-11-21 00:04:13 4294 2

原创 如何判断!!和不同变量字符串的真假值

1、问题背景 在JavaScript中,有null、undefined、空字符串、数值等,如果这些值前加上!!,真假值又是如何呢?2、实现源码<!DOCTYPE html><html> <head> <meta charset="utf-8"> <title></title> <s...

2019-11-19 11:08:55 510

原创 如何判断变量x的值并打印正常值

1、问题背景 在JavaScript中,定义了一个变量x,立即执行函数内部也定义了x,并且在后面对x重新赋值;分别在这几处打印变量x的值2、实现源码<!DOCTYPE html><html> <head> <meta charset="utf-8"> <title></title> &l...

2019-11-19 10:58:32 345

原创 [Vue warn]: Injection "elForm" not found

1、错误描述2、错误原因 在使用<el-form-item>标签时,外层没有加<el-form>,导致出现报错 <el-form-item> <el-button type="search" @click="searchData">查询</el-button> <el-b...

2019-11-18 10:12:49 7744 1

原创 UnicodeDecodeError: 'utf-32-le' codec can't decode bytes in position 0-3: code point not in range

1、错误描述F:\PyCharmWorkSpace\cmn\venv\Scripts\python.exe F:/PyCharmWorkSpace/cmn/venv/numpys/A.py[ True True True True]F:/PyCharmWorkSpace/cmn/venv/numpys/A.py:7: DeprecationWarning: In future, i...

2019-11-08 09:32:09 1131

原创 如何控制steps步长和居中显示

1、问题背景 步骤条在正常情况下,占据宽度为100%;如果外层设置文字内容居中,会导致线和圆圈脱离,不在对应的位置上2、实现源码<el-steps :active="active" finish-status="success"> <el-step title="第一步"></el-step> <el-step title=...

2019-11-05 10:17:04 974

原创 1251-Client does not support authentication protocol requested by server

1、错误描述使用Navicat连接MySQL8.02、错误原因 使用MySQL客户端Navicat连接数据库MySQL8.0,MySQL8.0之前的版本中加密规则是mysql_native_password,而MySQL8.0,加密规则是caching_sha2_password3、解决办法(1)将加密规则还原成mysql_native_password...

2019-11-01 15:02:31 2866 1

原创 AttributeError: 'NoneType' object has no attribute 'span'

1、错误描述E:\PycharmProjects\cmn\venv\Scripts\python.exe E:/PycharmProjects/cmn/venv/com.you.cmn/L.pyTraceback (most recent call last): File "E:/PycharmProjects/cmn/venv/com.you.cmn/L.py", line 3, i...

2019-10-28 14:50:10 1467

原创 TypeError: 'int' object is not callable

1、错误描述>>> import time;>>> time.altzone();Traceback (most recent call last): File "<pyshell#14>", line 1, in <module> time.altzone();TypeError: 'int' object is...

2019-10-22 16:24:06 335

原创 TypeError: unhashable type: 'list'

1、错误描述>>> e = {['n']:'zahng','age':'23'};Traceback (most recent call last): File "<pyshell#76>", line 1, in <module> e = {['n']:'zahng','age':'23'};TypeError: unhashabl...

2019-10-22 15:50:54 5501

原创 python中打印换行和不换行

1、问题背景 在python语言中,使用print()进行打印,默认是换行打印;如果要实现不换行打印,可以在print()添加第二个参数end=''2、实现源码nums = [12,34,45,64,77,89,90,21,34,54];even = [];odd = [];i = 0;while i < len(nums): num = nums.p...

2019-10-21 16:45:01 4107

原创 TypeError: 'int' object is not subscriptable

1、错误描述E:\PycharmProjects\cmn\venv\Scripts\python.exe E:/PycharmProjects/cmn/venv/com.you.cmn/E.pyTraceback (most recent call last): File "E:/PycharmProjects/cmn/venv/com.you.cmn/E.py", line 8, i...

2019-10-21 15:28:04 8080 1

原创 KeyError: 1

1、错误描述E:\PycharmProjects\cmn\venv\Scripts\python.exe E:/PycharmProjects/cmn/venv/com.you.cmn/B.py1('you', 2)(2, 'hai', 3, 'dong')('hai', 3)(1, 'you', 2, 'hai', 3, 'dong', 1, 'you', 2, 'hai', 3...

2019-10-21 11:47:55 2283

原创 TypeError: list indices must be integers or slices, not tuple

1、错误描述E:\PycharmProjects\cmn\venv\Scripts\python.exe E:/PycharmProjects/cmn/venv/com.you.cmn/A.pyTraceback (most recent call last): File "E:/PycharmProjects/cmn/venv/com.you.cmn/A.py", line 15, ...

2019-10-21 11:32:24 583

原创 No Python at ‘E:\Python\python.exe’

1、错误描述2、错误原因 由于python版本更新,需要升级,先将原来的python卸载了,然后安装新版本(3.8.0),结果pycharm找不到python编辑器3、解决办法(1)重新配置python编译器(2)创建新项目,选择新版本编译器...

2019-10-21 10:18:41 14002 3

原创 文件中的本地资源图片无法通过 WXSS 获取,可以使用网络图片,或者 base64,或者使用image标签

1、错误描述VM3930:1 pages/def/def.wxss 中的本地资源图片无法通过 WXSS 获取,可以使用网络图片,或者 base64,或者使用<image/>标签。请参考文档:https://developers.weixin.qq.com/miniprogram/dev/qa.html#%E6%9C%AC%E5%9C%B0%E8%B5%84%E6%BA%90%E6...

2019-09-06 11:57:49 5647 3

原创 根据 sitemap 的规则[0],当前页面 [pages/his/his] 将被索引

1、错误原因Fri Sep 06 2019 10:34:15 GMT+0800 (中国标准时间) sitemap 索引情况提示VM3445:1 根据 sitemap 的规则[0],当前页面 [pages/index/index] 将被索引console.warn @ VM3445:1(anonymous) @ VM3546:6(anonymous) @ VM3546:13VM34...

2019-09-06 10:39:56 12924

原创 Invalid prop: type check failed for prop "name". Expected String with value "17", got Number with va

1、错误描述vue.runtime.esm.js:631 [Vue warn]: Invalid prop: type check failed for prop "name". Expected String with value "17", got Number with value 17.found in---> <ElCheckbox> at package...

2019-09-04 10:49:01 9357

原创 FATAL ERROR: Ineffective mark-compacts near heap limit Allocation failed - JavaScript heap out of me

1、错误描述Administrator@USER-0GUONPPBHK MINGW64 /g/HBuilderXWork/erp-html (master)$ npm run dev> erp2@0.1.0 dev G:\HBuilderXWork\erp-html> vue-cli-service serve INFO Starting development s...

2019-09-03 14:13:41 11295 3

原创 如何使用Vue.js中的set设置对象属性值

1、问题背景 使用vue初始化一个对象v,并在data中初始化一个空对象obj,然后使用Vue.set()给对象obj添加属性2、实现源码<!DOCTYPE html><html> <head> <meta charset="utf-8"> <title></title> <...

2019-09-03 09:31:21 5082

原创 module "pages/index/wx-server-sdk" is not defined

1、错误描述VM542:1 thirdScriptErrormodule "pages/index/wx-server-sdk" is not defined; [Component] Event Handler Error @ pages/index/index#bound submitDataError: module "pages/index/wx-server-sdk" is n...

2019-09-02 10:41:42 4754

原创 如何使用Vue.js中的过滤器实现幂方求值

1、应用场景 使用ElementUI实现一个输入框,输入100,下方显示10000。2、实现源码(1)主页面<template> <el-row> <el-tabs v-model="activeName" @tab-click="handlerClick"> <el-tab-pane label="饼图" name...

2019-08-24 15:19:21 172

原创 TypeError: Router.use() requires a middleware function but got a Object

1、错误描述C:\Users\Administrator.USER-0GUONPPBHK>cd G:\HBuilderXWork\Vue\serverC:\Users\Administrator.USER-0GUONPPBHK>g:G:\HBuilderXWork\Vue\server>node indexG:\HBuilderXWork\Vue\node_mod...

2019-07-04 16:30:09 1906

原创 如何使用vue.js组件模拟v-model指令?

1、问题描述 在使用v-model指令实现输入框数据双向绑定,输入值时对应的这个变量的值也随着变化;但是这里不允许使用v-model,需要写一个组件实现v-model指令效果<div id="user"> <input type="text" v-model="username"> <label>{{username}}</...

2019-07-03 16:17:13 685

原创 TypeError: Cannot read property 'apply' of undefined

1、错误描述Administrator@USER-0GUONPPBHK MINGW64 /g/HBuilderXWork/Vue$ npm install --save-dev gulpnpm WARN rollback Rolling back readable-stream@2.3.6 failed (this is probably ha ...

2019-07-01 11:26:29 13211

原创 1452-Cannot add or update a child row: a foreign key constraint fails

1、错误描述MySQL2、错误原因 t_nums表中的name不属于t_stu表中的name,t_stu表中的name是字母和数字构成的,而t_nums表中name是数字构成的,两者没有重合的部分,所以会出现报错。3、解决办法(1)修改t_stu表中的name对应的值,使它属于t_nums表中的name值范围;(2)修改t_nums表中的name对应的值,...

2019-06-13 11:53:08 3690 2

原创 Uncaught DOMException: Failed to execute 'setAttribute' on 'Element': '#' is not a valid attribute

1、错误描述2、错误原因<current-user> <slot v-bind:user="user"> {{user.username}} </slot> <template v-slot:default="slotProps"> {{slotProps.user.firstname}} </template&g...

2019-05-29 10:02:41 9145

原创 Uncaught TypeError: Cannot set property 'render' of undefined

1、错误描述2、错误原因<template> <arm-info arm-title="hands"></arm-info></template><script> import Vue from 'vue' Vue.component('arm-info',{ props:['armTitle'], ...

2019-05-27 10:45:14 3768 2

原创 Cannot use v-for on stateful component root element because it renders multiple elements

1、错误描述2、错误原因<template> <blog-info v-for="info in infos" v-bind:key="info.id" v:bind:title="info.title"></blog-info></template><script> expor...

2019-05-24 16:35:43 613

MyEclipse2017 SVN插件.zip

MyEclipse2017 SVN插件,对应文件夹依次覆盖;然后重启MyEclipse,即可使用SVN

2020-05-07

AR接入路由器产品文档.chm

AR系列接入路由器,了解产品(硬件描述和产品描述)、安装调测(硬件安装与维护和License使用)、配置部署和操作维护

2020-11-10

aopalliance.jar

解决 Caused by: java.lang.ClassNotFoundException: org.aopalliance.intercept.MethodInterceptor

2014-07-12

dojo实现省份地市级联

1、web目录只需部署到Web项目可以运行; 2、这里包含省份和地市的数据源,以及引入的页面

2014-01-25

mysql-connect.rar

mysql-connector是Java连接MySQL8.0数据库的不同版本的jar包,作为驱动程序包

2019-08-15

SVN插件1.8版本,MyEclipse和Eclipse都可使用

SVN1.8版本,可以使用在MyEclipse和Eclipse开发工具上

2017-11-14

dojo省份地市级联JSON数据源

1、压缩文件是JSON格式,提供数据源; 2、省份JSON包括全国省份名称以及自治市,地市包括各个地级市以及县级市,都是根据资料查到的

2014-01-25

ejb3-persistence.jar

解决Caused by: java.lang.ClassNotFoundException: javax.persistence.Entity

2014-07-12

Flex和Servlet结合上传文件

1、利用Flex作为上传文件界面,通过servlet地址连接服务器端 2、Servlet处理上传文件过程 3、通过配置文件web.xml传递参数 4、达到Flex和Servlet进行交互,上传文件

2014-04-27

Flex中运用FusionCharts

1、Flex中配置FusionCharts说明文档是说明Flex项目和Java Web项目整合的过程 2、Fusionchart是Flex项目代码 3、Flex是Java Web项目代码 4、Java Web项目中有Flex项目所需的配置文件 5、Flex项目中用Fusioncharts插件文件

2014-05-14

Servlet文件上传

1、通过界面上传文件(一个或两个文件) 2、上传文件存放在服务器上指定文件下 3、servlet处理上传文件过程 4、上传成功后跳转到结果页面

2014-04-27

翱翔天地的留言板

发表于 2020-01-02 最后回复 2020-01-27

dojo如何实现省份地市级联

发表于 2014-01-25 最后回复 2014-02-10

空空如也

TA创建的收藏夹 TA关注的收藏夹

TA关注的人 TA的粉丝

提示
确定要删除当前文章?
取消 删除