Failed to execute goal on project ecz-wx: Could not resolve dependencies for project

maven项目时报错将项目Install一下,

[ERROR] Failed to execute goal on project sypro: Could not resolve dependencies

12-20

[b]自己搭建一个Maven私服后,随便找一个项目去测试,mvn install的时候出现下边的异常,求解!!![/b]rn[java] view plaincopyrn[INFO] Scanning for projects... rn[WARNING] rn[WARNING] Some problems were encountered while building the effective model for sy.demo:sypro:war:0.0.1-SNAPSHOT rn[WARNING] 'build.plugins.plugin.version' for org.mortbay.jetty:maven-jetty-plugin is missing. @ line 151, column 12 rn[WARNING] 'build.plugins.plugin.version' for org.apache.maven.plugins:maven-compiler-plugin is missing. @ line 141, column 12 rn[WARNING] rn[WARNING] It is highly recommended to fix these problems because they threaten the stability of your build. rn[WARNING] rn[WARNING] For this reason, future Maven versions might no longer support building such malformed projects. rn[WARNING] rn[INFO] rn[INFO] ------------------------------------------------------------------------ rn[INFO] Building sypro Maven Webapp 0.0.1-SNAPSHOT rn[INFO] ------------------------------------------------------------------------ rnSLF4J: Failed to load class "org.slf4j.impl.StaticLoggerBinder". rnSLF4J: Defaulting to no-operation (NOP) logger implementation rnSLF4J: See http://www.slf4j.org/codes.html#StaticLoggerBinder for further details. rnDownloading: http://192.168.1.100:8081/nexus/content/groups/public/org/springframework/spring-core/3.2.3.RELEASE/spring-core-3.2.3.RELEASE.jar rnDownloading: http://192.168.1.100:8081/nexus/content/groups/public/org/springframework/spring-jdbc/3.2.3.RELEASE/spring-jdbc-3.2.3.RELEASE.jar rnDownloading: http://192.168.1.100:8081/nexus/content/groups/public/org/springframework/spring-tx/3.2.3.RELEASE/spring-tx-3.2.3.RELEASE.jar rnDownloading: http://192.168.1.100:8081/nexus/content/groups/public/net/sf/ehcache/ehcache/2.7.0/ehcache-2.7.0.jar rnDownloading: http://192.168.1.100:8081/nexus/content/groups/public/org/javassist/javassist/3.15.0-GA/javassist-3.15.0-GA.jar rnDownloading: http://192.168.1.100:8081/nexus/content/groups/public/junit/junit/4.11/junit-4.11.jar rnDownloading: http://192.168.1.100:8081/nexus/content/groups/public/org/aspectj/aspectjweaver/1.7.2/aspectjweaver-1.7.2.jar rnDownloading: http://192.168.1.100:8081/nexus/content/groups/public/com/alibaba/fastjson/1.1.31/fastjson-1.1.31.jar rnDownloading: http://192.168.1.100:8081/nexus/content/groups/public/javax/servlet/servlet-api/2.5/servlet-api-2.5.jar rn[INFO] ------------------------------------------------------------------------ rn[INFO] BUILD FAILURE rn[INFO] ------------------------------------------------------------------------ rn[INFO] Total time: 1.578s rn[INFO] Finished at: Fri Dec 20 14:47:59 CST 2013 rn[INFO] Final Memory: 8M/100M rn[INFO] ------------------------------------------------------------------------ rn[ERROR] Failed to execute goal on project sypro: Could not resolve dependencies for project sy.demo:sypro:war:0.0.1-SNAPSHOT: The following artifacts could not be resolved: org.springframework:spring-core:jar:3.2.3.RELEASE, org.springframework:spring-jdbc:jar:3.2.3.RELEASE, org.springframework:spring-tx:jar:3.2.3.RELEASE, net.sf.ehcache:ehcache:jar:2.7.0, org.javassist:javassist:jar:3.15.0-GA, junit:junit:jar:4.11, org.aspectj:aspectjweaver:jar:1.7.2, com.alibaba:fastjson:jar:1.1.31, javax.servlet:servlet-api:jar:2.5: Could not find artifact org.springframework:spring-core:jar:3.2.3.RELEASE in nexus (http://192.168.1.100:8081/nexus/content/groups/public/) -> [Help 1] rn[ERROR] rn[ERROR] To see the full stack trace of the errors, re-run Maven with the -e switch. rn[ERROR] Re-run Maven using the -X switch to enable full debug logging. rn[ERROR] rn[ERROR] For more information about the errors and possible solutions, please read the following articles: rn[ERROR] [Help 1] http://cwiki.apache.org/confluence/display/MAVEN/DependencyResolutionException

没有更多推荐了,返回首页

私密
私密原因:
请选择设置私密原因
  • 广告
  • 抄袭
  • 版权
  • 政治
  • 色情
  • 无意义
  • 其他
其他原因:
120
出错啦
系统繁忙,请稍后再试

关闭