读取excel文件时报错:ImportError: Install xlrd >= 0.9.0 for Excel support

展开阅读全文

maven install报错

07-07

WARNING] Missing POM for org.apache.maven.surefire:surefire-junit3:jar:2.16rn[INFO] Downloading: http://mirrors.ibiblio.org/pub/mirrors/maven2/org/apache/maven/surefire/surefire-junit3/2.16/surefire-junit3-2.16.jarrn[INFO] ------------------------------------------------------------------------rn[INFO] Reactor Summary:rn[INFO] rn[INFO] smartrouter ........................................ SUCCESS [ 15.674 s]rn[INFO] A Smart Log Control Bundle ......................... FAILURE [ 23.133 s]rn[INFO] JNI Manage Bundle .................................. SKIPPEDrn[INFO] Gateway Manage Bundle .............................. SKIPPEDrn[INFO] commonUtil Bundle .................................. SKIPPEDrn[INFO] Bundel Manage Center ............................... SKIPPEDrn[INFO] ------------------------------------------------------------------------rn[INFO] BUILD FAILURErn[INFO] ------------------------------------------------------------------------rn[INFO] Total time: 40.602 srn[INFO] Finished at: 2014-07-07T21:02:56+08:00rn[INFO] Final Memory: 12M/29Mrn[INFO] ------------------------------------------------------------------------rn[ERROR] Failed to execute goal org.apache.maven.plugins:maven-surefire-plugin:2.16:test (default-test) on project com.gj.s304.smartlog: Unable to generate classpath: org.apache.maven.artifact.resolver.MultipleArtifactsNotFoundException: Missing:rn[ERROR] ----------rn[ERROR] 1) org.apache.maven.surefire:surefire-junit3:jar:2.16rn[ERROR] rn[ERROR] Try downloading the file manually from the project website.rn[ERROR] rn[ERROR] Then, install it using the command:rn[ERROR] mvn install:install-file -DgroupId=org.apache.maven.surefire -DartifactId=surefire-junit3 -Dversion=2.16 -Dpackaging=jar -Dfile=/path/to/filern[ERROR] rn[ERROR] Alternatively, if you host your own repository you can deploy the file there:rn[ERROR] mvn deploy:deploy-file -DgroupId=org.apache.maven.surefire -DartifactId=surefire-junit3 -Dversion=2.16 -Dpackaging=jar -Dfile=/path/to/file -Durl=[url] -DrepositoryId=[id]rn[ERROR] rn[ERROR] Path to dependency:rn[ERROR] 1) dummy:dummy:jar:1.0rn[ERROR] 2) org.apache.maven.surefire:surefire-junit3:jar:2.16rn[ERROR] rn[ERROR] ----------rn[ERROR] 1 required artifact is missing.rn[ERROR] rn[ERROR] for artifact:rn[ERROR] dummy:dummy:jar:1.0rn[ERROR] rn[ERROR] from the specified remote repositories:rn[ERROR] ibiblio.org (http://mirrors.ibiblio.org/pub/mirrors/maven2, releases=true, snapshots=false)rn[ERROR] -> [Help 1]rn[ERROR] rn[ERROR] To see the full stack trace of the errors, re-run Maven with the -e switch.rn[ERROR] Re-run Maven using the -X switch to enable full debug logging.rn[ERROR] rn[ERROR] For more information about the errors and possible solutions, please read the following articles:rn[ERROR] [Help 1] http://cwiki.apache.org/confluence/display/MAVEN/MojoExecutionExceptionrn[ERROR] rn[ERROR] After correcting the problems, you can resume the build with the commandrn[ERROR] mvn -rf :com.gj.s304.smartlogrnrnrnrn请大家帮忙给看一下 论坛

没有更多推荐了,返回首页