python 3.8.0 编译报错 Could not import runpy module 解决方案

环境

  • CentOS 7
  • Gcc 4.8.5
  • Python 3.8.0

相关报错

make build_all CFLAGS_NODIST=" -fprofile-use -fprofile-correction" LDFLAGS_NODIST=""
make[1]: Entering directory `/usr/local/src/Python-3.8.0'
./python -E -S -m sysconfig --generate-posix-vars ;\
if test $? -ne 0 ; then \
	echo "generate-posix-vars failed" ; \
	rm -f ./pybuilddir.txt ; \
	exit 1 ; \
fi
Could not import runpy module
Traceback (most recent call last):
  File "/usr/local/src/Python-3.8.0/Lib/runpy.py", line 15, in <module>
    import importlib.util
  File "/usr/local/src/Python-3.8.0/Lib/importlib/util.py", line 14, in <module>
    from contextlib import contextmanager
  File "/usr/local/src/Python-3.8.0/Lib/contextlib.py", line 4, in <module>
    import _collections_abc
SystemError: <built-in function compile> returned NULL without setting an error
generate-posix-vars failed
make[1]: *** [pybuilddir.txt] Error 1
make[1]: Leaving directory `/usr/local/src/Python-3.8.0'
make: *** [profile-opt] Error 2

导致原因

  • 在低版本的gcc版本中带有 --enable-optimizations 参数时会出现上面问题
  • gcc 8.1.0修复此问题

解决方法如下

  • 1、升级gcc至8.1.0【不推荐】
  • 2、./configure参数中去掉 --enable-optimizations

 

 

 

©️2022 CSDN 皮肤主题:代码科技 设计师:Amelia_0503 返回首页
实付
使用余额支付
点击重新获取
扫码支付
钱包余额 0

抵扣说明:

1.余额是钱包充值的虚拟货币,按照1:1的比例进行支付金额的抵扣。
2.余额无法直接购买下载,可以购买VIP、C币套餐、付费专栏及课程。

余额充值