maven安装jar包到本地仓库报的一个错误:Could not find goal '' in plugin org.apache.maven.plugins

今天在将jar包加入本地仓库的时候,由于拼写没有注意,报了一个错误:


Could not find goal '' in plugin org.apache.maven.plugins。下面贴出来供自己将来温习,避免再犯类似的错误。

执行maven命令,将jar包安装到本地仓库

E:\repository\lucene-analyzers-common\lucene-analyzers-common-6.3.0>mvn install: install-file -Dfile=lucene-analyzers-common-6.3.0.jar -DgroupId=org.apache.lucene -DartifactId=lucene-analyzers-common-6.3.0 -Dversion=6.3.0 -Dpackaging=jar

dos屏幕输入如下(注意install: install-file 之间有空格,就是这个可恶的空格导致安装报错):
[INFO] Scanning for projects...
[INFO] ------------------------------------------------------------------------
[INFO] BUILD FAILURE
[INFO] ------------------------------------------------------------------------
[INFO] Total time: 0.516 s
[INFO] Finished at: 2016-11-23T15:59:30+08:00
[INFO] Final Memory: 6M/116M
[INFO] ------------------------------------------------------------------------
[ERROR] Could not find goal '' in plugin org.apache.maven.plugins:maven-install-plugin:2.4 among available goals install, install-file, help -> [Help 1]
[ERROR]
[ERROR] To see the full stack trace of the errors, re-run Maven with the -e switch.
[ERROR] Re-run Maven using the -X switch to enable full debug logging.
[ERROR]
[ERROR] For more information about the errors and possible solutions, please read the following articles:
[ERROR] [Help 1] http://cwiki.apache.org/confluence/display/MAVEN/MojoNotFoundException


然后将空格去掉,重新安装:

E:\repository\lucene-analyzers-common\lucene-analyzers-common-6.3.0>mvn install:install-file -Dfile=lucene-analyzers-common-6.3.0.jar -DgroupId=org.apache.lucene -DartifactId=lucene-analyzers-common-6.3.0 -Dversion=6.3.0 -Dpackaging=jar

执行之后,安装成功

[INFO] Scanning for projects...
[INFO]
[INFO] ------------------------------------------------------------------------
[INFO] Building lucene-analyzers-common-6.3.0 6.3.0
[INFO] ------------------------------------------------------------------------
[INFO]
[INFO] --- maven-install-plugin:2.4:install-file (default-cli) @ lucene-analyzers-common-6.3.0 ---
[INFO] Installing E:\repository\lucene-analyzers-common\lucene-analyzers-common-6.3.0\lucene-analyzers-common-6.3.0.jar to E:\repository\org\apache\lucene\lucene-analyzers-common-6.3.0\6.3.0\lucene-analyzers-common-6.3.0-6.3.0.jar
[INFO] Installing C:\Users\ADMINI~1\AppData\Local\Temp\mvninstall7440662213605341926.pom to E:\repository\org\apache\lucene\lucene-analyzers-common-6.3.0\6.3.0\lucene-analyzers-common-6.3.0-6.3.0.pom
[INFO] ------------------------------------------------------------------------
[INFO] BUILD SUCCESS
[INFO] ------------------------------------------------------------------------
[INFO] Total time: 1.188 s
[INFO] Finished at: 2016-11-23T16:01:20+08:00
[INFO] Final Memory: 7M/116M
[INFO] ------------------------------------------------------------------------

展开阅读全文

没有更多推荐了,返回首页