Cocos2dx报错undefined reference to 'cocos2d::Sprite::setDisplayFrameWithAnimationName(std::__1::basic

错误信息如下:

./obj/local/armeabi/objs-debug/cocos2dcpp_shared/__/__/Classes/ActorSprite.o:jni
/../../Classes/ActorSprite.cpp:function vtable for ActorSprite: error: undefined
 reference to 'cocos2d::Sprite::setDisplayFrameWithAnimationName(std::__1::basic
_string<char, std::__1::char_traits<char>, std::__1::allocator<char> > const&, l
ong)'
clang++.exe: error: linker command failed with exit code 1 (use -v to see invoca
tion)
make.exe: *** [obj/local/armeabi/libcocos2dcpp.so] Error 1

从出错信息来看是说在ActorSprite类的虚函数表中找不到关于setDisplayFrameWithAnimationName函数的定义,这就怪了我的ActorSprite明明就是从Sprite继承来的,查了一下setDisplayFrameWithAnimationName这个函数只有2个参数的但这里居然说有4个参数,百思不得其解,后来总算在一个日本的开发者网站查到原因了:http://shakezoomer.com/?p=769

解决方法:就是在项目的proj.android目录下执行命令行build_native.py -n clean,执行一遍报错就多执行几遍(反正我是执行了两遍),这个命令应该是把先前编译的库文件都清掉,然后重新编译你的项目文件就可以了。



总结:由于我先前用的NDK是r10d版本的,听说3.2版的需要r9d才换回去,这就导致一个问题就是先前已经在r10d下编译的一些库文件没清掉,干掉它们再换回r9d就OK了!

阅读更多
文章标签: cocos2d-x android
上一篇JS正则表达式整理(不断更新中...)
下一篇Win7下修改注册表设置Chrom为默认浏览器的方法
想对作者说点什么? 我来说一句

没有更多推荐了,返回首页

关闭
关闭
关闭